program: Gaussian 09
title: 000210686
version: EM64L-G09RevD.01
frameworkgroup: C1[X(C11H11NOS2)]
method: RPBEPBE
basis: SDD
operation: Freq
keyword: #p
keyword: freq=noraman
keyword: PBEPBE/SDD
title: #p freq=noraman PBEPBE/SDD
converged: YES YES NO NO
title: Mulliken charges:
elementType: S S O N C C C C C C C C C C C H H H H H H H H H H H
charge: 0.314572 0.113858 -0.219410 -0.022533 -0.565724 -0.599746 0.338535 0.509364 -0.546116 -0.628204 -0.373720 -0.387029 -0.234513 -0.227933 -0.232851 0.311496 0.255605 0.258560 0.252548 0.238198 0.237414 0.265548 0.255292 0.228051 0.228444 0.230293
chargesum: 0.00000
title: Mulliken charges with hydrogens summed into heavy atoms:
elementType: S S O N C C C C C C C C C C C
charge: 0.314572 0.113858 -0.219410 -0.022533 -0.254229 -0.085581 0.338535 0.509364 -0.546116 0.099957 -0.108172 -0.131737 -0.006462 0.000511 -0.002558
polarizability: 1.80203044e+02 1.18801010e+01 1.91527244e+02 -2.95336605e+00 3.51875767e+00 9.86784100e+01
1716.lowfreq: -13.0257 -8.5025 -3.9212 0.0018 0.0019 0.0020 15.9415 44.9321 53.9841
frequency: 15.4154 44.9134 53.9628 68.7120 95.1418 189.5518 205.5879 218.5086 230.8733 282.8835 291.6457 341.6739 377.6503 401.5797 403.9140 436.1928 485.7014 504.7797 526.9770 567.6980 617.0460 617.5817 676.1501 703.9212 715.5263 758.1098 809.7635 821.2986 860.3591 904.8545 940.3636 958.6080 985.0369 990.2974 1000.9846 1010.0269 1024.2316 1027.4307 1074.3036 1085.1935 1101.4684 1173.7752 1189.9904 1190.7152 1207.6401 1211.3410 1264.0697 1276.6420 1317.6504 1347.8674 1371.1111 1386.1303 1392.0011 1443.7850 1449.9881 1467.7952 1474.5492 1483.9504 1594.0515 1613.4192 1624.8615 2999.0804 3031.0367 3045.6344 3095.6237 3100.9708 3111.2190 3125.0706 3132.4439 3143.0354 3152.2462 3165.7872
redmass: 4.4110 5.9001 4.5968 6.6157 8.2104 5.7859 5.5477 4.1762 1.0616 6.6281 5.2235 5.4302 2.1330 7.6579 3.0768 4.8284 4.9624 14.1648 9.1812 5.1832 5.7339 4.9215 4.2782 2.1308 3.2851 2.1457 3.3860 3.3965 1.2443 3.4649 1.5446 2.2019 1.3859 5.8035 1.3403 1.6615 2.7217 2.2364 2.5536 1.7071 2.4156 1.0578 1.3663 1.2814 1.5951 2.8962 5.5078 1.3836 1.7050 1.5228 1.3966 5.7053 1.1850 1.9316 1.1866 1.0463 1.0491 2.2263 6.0660 6.0239 11.0038 1.0349 1.0587 1.0844 1.1052 1.1002 1.1015 1.0848 1.0881 1.0927 1.0967 1.1017
irintensity: 0.3857 1.2743 0.7374 0.3032 3.4597 1.1487 1.3008 0.4021 0.2218 9.2276 1.6660 8.8542 2.4161 4.4202 0.3563 2.6554 18.2578 3.5201 7.8922 24.2286 6.3589 18.1145 1.7299 35.3069 49.9472 24.9604 1.8837 5.2535 1.4529 19.0503 15.7115 24.3956 1.8964 0.1771 1.8511 7.0456 22.8449 5.1555 8.7998 51.0186 21.0066 1.3110 54.2273 35.0123 148.1627 8.9064 165.7220 7.0718 117.9889 72.3189 30.1005 10.9474 16.1275 12.0378 30.1630 19.9162 8.3529 18.5048 4.6850 1.5891 183.3771 18.6444 13.8745 2.0541 0.4489 7.9236 15.3505 0.1861 3.7647 13.5718 21.3672 23.0186
temp: 298.150 k
press: 1.00000 atm
elementType: 16 16 8 7 6 6 6 6 6 6 6 6 6 6 6 1 1 1 1 1 1 1 1 1 1 1
symmnumber: 1
zpe: 514450.5 jmol-1
zpe.correction: 0.195944 hartree
zpe.thermalcorrener: 0.209951 hartree
zpe.thermalcorrenthalpy: 0.210895 hartree
zpe.thermalcorrgfe: 0.152708 hartree
zpe.sumelectzpe: -1350.808407 hartree
zpe.sumelectthermal: -1350.794401 hartree
zpe.sumelectthermalent: -1350.793456 hartree
zpe.sumelectthermalfe: -1350.851644 hartree
dipole: -0.3321 -1.9693 -0.4474
dipole: 2.0466
quadrupole: -90.9859 -109.6268 -101.5283
quadrupole: 7.4186 -1.9289 3.7891
quadrupole: 9.7277 -8.9131 -0.8146 7.4186 -1.9289 3.7891
hfenergy: -1351.0043513 hartree
pointgroup: C01 [X(C11H11N1O1S2)]
dipole: -0.1784449 -0.7555007 -0.2137956 debye
dipolederiv: -0.473175 -0.1794382 -0.2285542 -0.2312849 -0.1512859 -0.1003779 -0.3288812 -0.0902243 -0.1402674 -0.3826907 -0.2339884 -0.1223205 -0.2399612 -0.7386688 -0.1551241 -0.1801584 -0.1764503 -0.212074 -0.5352123 0.1881094 -0.0725116 -0.0184721 -1.1115086 0.1058227 -0.0947642 0.2574073 -0.3875615 -0.8122181 -0.1422976 -0.1659275 0.1526254 -1.6133174 0.1182344 -0.4032893 -0.0102359 -0.2795841 -0.2196682 0.0313625 -0.2206271 0.0698275 0.3447587 -0.0216961 -0.2796461 0.0199526 -0.0179442 0.7183183 -0.1216418 -0.0056652 -0.0292037 0.0872459 0.026114 0.1379484 -0.0572375 0.2991702 0.6523135 0.2303155 0.2125822 0.2627848 1.5180499 -0.056733 0.3488987 0.0228426 0.3416274 0.0944189 -0.0258859 -0.0778132 -0.0177683 0.0080074 0.0078693 -0.0722463 0.0185148 -0.1267192 0.8051898 0.1559325 0.5880266 0.0870044 1.5453437 0.1564307 0.7553409 0.0421923 0.2429491 0.0841096 0.040045 0.0462482 -0.0650172 -0.0707478 0.0232593 -0.0248765 0.0031182 0.0390072 -0.0942245 0.0908279 -0.0485948 0.0386154 -0.0342064 -0.0031887 -0.0308882 -0.0050239 -0.1131186 -0.1287893 -0.055778 -0.0423694 -0.0171494 -0.0114856 0.0195451 -0.0271857 0.0105775 -0.1111803 -0.1062799 -0.0592805 -0.0450557 -0.0668347 0.1242489 0.0471899 -0.0405757 0.0626276 -0.1155988 -0.0420151 0.1157758 -0.0576453 0.1289019 0.0648788 -0.0266852 -0.059604 -0.0499909 -0.1112583 0.0268165 -0.008845 -0.1272929 -0.0096134 -0.0435894 0.0191788 -0.1048642 0.0170225 -0.0781732 0.0497906 0.026092 0.043099 -0.0170709 -0.018866 -0.047453 0.041719 -0.0145188 0.0104122 -0.0180496 -0.006142 0.0363145 0.0098967 0.0163599 0.1276776 0.0066566 0.0166613 0.0593857 0.0119416 0.0080133 0.0142066 -0.0319936 0.0217646 -0.1408283 0.008422 -0.0154959 0.0870003 0.0676662 0.0174969 -0.0005501 -0.03027 -0.0898811 0.0127988 0.0361046 0.0501766 0.1132971 0.0795438 -0.0098518 0.0174928 0.0418406 0.064724 -0.0886015 0.0629647 -0.0566464 -0.0579459 -0.0578779 -0.0204951 -0.0781782 0.0315862 0.113117 0.0368479 -0.1098123 0.0139008 0.0043289 0.1022628 -0.1011811 0.0544032 -0.082661 0.0389156 0.0184203 0.0500986 0.0194436 0.1124083 0.1516473 0.0698279 0.0550627 0.0452802 -0.0224346 -0.0407753 0.0451898 -0.0322635 0.1104362 0.0702116 0.0479271 0.0450868 0.0719024 -0.0907537 -0.0528915 0.0578775 -0.0529085 0.1226879 0.0198226 -0.0810275 0.0592122 -0.1083996 -0.0396049 0.0343721 0.0702116 0.0282459 0.123252 -0.0638525 0.0241272 0.1213708 0.0254344 0.0889358 -0.0194063 0.1353598 -0.0216877 0.0854629 unknown
polarizability: 181.9525634|12.4508699|189.3377154|-0.0104767|7.991156|99.1184192 unknown
InChI: InChI=1S/C11H11NOS2/c1-8-10(13)12(11(14)15-8)7-9-5-3-2-4-6-9/h2-6,8H,7H2,1H3
charge 0 multiplicity 1
26 atoms
S  -2.981368 1.236301 -1.000686
S  -0.937259 3.04613 0.42641
O  -1.321177 -2.048699 0.510224
N  -1.005993 0.284384 0.505575
C  -2.874494 -0.652944 -0.788691
C  0.20943 0.193288 1.3760
C  -1.671254 -0.904359 0.1253
C  1.497401 -0.005035 0.584204
C  -1.51984 1.510158 0.059535
C  -4.168926 -1.26397 -0.221607
C  1.913471 -1.309978 0.212934
C  2.302261 1.107086 0.228933
C  3.112308 -1.497258 -0.509975
C  3.501468 0.918393 -0.494049
C  3.909008 -0.383755 -0.865755
H  -2.645108 -1.076859 -1.781967
H  0.028769 -0.66362 2.04772
H  0.239606 1.128065 1.960124
H  -4.015792 -2.345789 -0.059864
H  -4.43948 -0.79802 0.740695
H  -5.00744 -1.127259 -0.924717
H  1.292434 -2.169897 0.488696
H  1.98154 2.115583 0.513233
H  3.427094 -2.508479 -0.790787
H  4.116994 1.783762 -0.763787
H  4.840545 -0.529827 -1.424101
