program: Gaussian 09
title: 000210684
version: EM64L-G09RevD.01
frameworkgroup: C1[X(C27H29NO2)]
method: RPBEPBE
basis: SDD
operation: Freq
keyword: #p
keyword: freq=noraman
keyword: PBEPBE/SDD
title: #p freq=noraman PBEPBE/SDD
converged: NO YES NO NO
title: Mulliken charges:
elementType: O O N C C C C C C C C C C C C C C C C C C C C C C C C C C C H H H H H H H H H H H H H H H H H H H H H H H H H H H H H
charge: -0.256745 -0.261447 -0.328066 -0.097818 0.105174 0.075023 -0.420307 -0.480601 -0.467382 -0.419866 -0.352188 -0.417713 0.366262 0.393836 0.402621 -0.376493 -0.365449 -0.422628 -0.393854 -0.361062 -0.386151 -0.241427 -0.248090 -0.245330 -0.244015 -0.251455 -0.257655 -0.236425 -0.244883 -0.252538 0.217312 0.227828 0.212705 0.235008 0.245527 0.255631 0.214611 0.211674 0.187986 0.297188 0.185190 0.205050 0.166763 0.207241 0.263831 0.267219 0.237574 0.246405 0.250824 0.310085 0.226940 0.227863 0.225209 0.222305 0.227248 0.227384 0.229704 0.229662 0.224708
chargesum: 0.00000
title: Mulliken charges with hydrogens summed into heavy atoms:
elementType: O O N C C C C C C C C C C C C C C C C C C C C C C C C C C C
charge: -0.256745 -0.261447 -0.030878 0.119494 0.105174 0.075023 0.020227 -0.000067 0.002860 -0.020206 0.038052 -0.043709 0.366262 0.393836 0.402621 -0.112662 -0.098230 -0.185054 -0.147449 -0.110238 -0.076067 -0.014487 -0.020227 -0.020121 -0.021711 -0.024207 -0.030271 -0.006721 -0.015221 -0.027830
polarizability: 3.06594864e+02 7.91204931e+00 3.39080756e+02 4.30646938e+00 8.83323863e+00 2.28711246e+02
1716.lowfreq: -5.8347 0.0006 0.0008 0.0009 4.1598 12.5607 27.6299 32.8629 42.4496
frequency: 27.3282 32.8600 42.4367 53.9198 54.6068 63.9477 67.6179 70.7076 73.5679 115.9450 126.5287 177.4442 188.2553 194.4871 226.9211 229.4168 237.3015 259.8511 268.8875 281.6146 310.2127 314.3415 332.0518 362.6904 378.6474 400.1363 404.4115 404.7242 413.9742 439.5053 444.0599 477.0403 491.9946 492.3004 520.5010 537.8868 552.7255 570.2331 593.1118 615.4348 616.6214 618.3983 651.6381 676.5607 693.9125 704.3875 708.2547 713.1080 716.3408 725.7698 765.2728 768.9922 774.8702 821.2510 835.2821 851.9245 858.7918 865.9961 867.6132 877.7830 899.1927 907.0642 915.3156 923.1115 932.7688 938.1712 938.5617 944.6629 957.0972 960.4450 977.0975 978.9772 989.8313 990.5808 990.9710 993.2709 995.6675 997.7583 998.6867 1003.5785 1023.5968 1026.9694 1031.4349 1034.6971 1074.9355 1076.8504 1079.7740 1083.2337 1086.8985 1094.1722 1122.4684 1133.8986 1139.4300 1145.2860 1164.1979 1171.1811 1171.6180 1174.4408 1179.0968 1196.2896 1197.7323 1199.4320 1203.8840 1211.0391 1219.2782 1247.4492 1254.3744 1265.5803 1294.7459 1301.9680 1308.8920 1321.4835 1324.8914 1327.7165 1334.8140 1339.1152 1344.9770 1352.8587 1367.1555 1370.8368 1377.7757 1378.7814 1380.3775 1433.1498 1434.5003 1436.1640 1446.8569 1453.7300 1455.5576 1462.8403 1465.8840 1467.0148 1475.5757 1476.0491 1484.2778 1485.7162 1586.2564 1590.0779 1590.4058 1609.3381 1609.9191 1612.9310 2819.0341 2830.0892 2961.2958 2972.0922 2977.1769 2984.2246 3000.6137 3027.2437 3031.8558 3049.6152 3068.9353 3081.1695 3084.0188 3114.6560 3121.2841 3123.3709 3124.0457 3127.7730 3131.3521 3137.3191 3140.9013 3144.0039 3151.6716 3152.0059 3153.7376 3164.3786 3164.5870 3164.9341 3466.5895
redmass: 4.2707 4.5217 4.4661 4.1324 3.8179 3.6616 4.1699 4.1064 4.1028 4.8896 4.1482 3.7467 4.9922 3.6987 4.0050 2.3402 3.9035 4.8859 3.7196 4.2732 3.9303 3.7274 1.9520 3.5615 4.3337 2.8261 2.9926 2.9783 3.2318 3.2068 3.5094 4.3559 3.7241 4.3556 3.4904 1.7272 3.3566 3.6113 5.9038 6.4245 6.3771 6.4095 5.9051 5.6467 1.6039 1.7337 3.1347 2.5778 1.6718 2.3702 1.8098 1.9520 2.0370 2.3637 1.7748 1.2505 1.2544 1.6153 1.6979 2.5716 2.8346 3.0177 1.9342 1.7765 1.6929 2.0147 1.8965 1.9496 4.1563 3.2332 1.4015 1.5883 4.6785 3.2073 3.7835 1.4749 1.3763 1.6899 1.7662 1.6034 2.9231 2.3644 2.3060 2.5504 1.7460 1.8586 1.5479 1.7816 1.7070 2.1291 2.1746 2.5491 2.8539 2.6601 1.6906 1.0539 1.0540 1.0528 1.1883 1.4626 2.0393 1.1329 2.7214 2.4399 1.9490 1.2420 1.1941 1.2167 1.2923 1.3891 1.3408 1.2797 1.3532 1.3374 1.3709 1.4222 1.3549 1.4724 1.3983 1.7863 2.7128 5.4763 7.7388 2.1715 2.2544 2.2312 1.2252 1.1014 1.1642 1.0928 1.1216 1.0957 2.2237 1.0904 2.1349 2.0762 5.8998 6.2541 6.0404 6.0965 5.9132 5.9441 1.0788 1.0713 1.0629 1.0643 1.0642 1.0613 1.0612 1.0920 1.0909 1.1036 1.1030 1.0988 1.1000 1.0851 1.0850 1.0846 1.0877 1.0873 1.0877 1.0935 1.0925 1.0922 1.0949 1.0957 1.0972 1.0992 1.1008 1.1010 1.0746
irintensity: 0.2841 0.0633 0.1812 0.1070 0.2986 0.2471 0.4955 0.2619 0.0909 0.8019 0.4994 0.7650 0.4285 0.7282 0.4360 1.0202 0.7118 1.5753 0.2680 2.3386 0.4211 1.0552 0.5929 6.1857 14.5788 0.0777 1.4174 0.9306 0.3427 11.9903 0.2988 1.8727 1.3098 6.8139 8.9652 39.6655 25.9466 12.5878 17.3403 0.1244 0.2883 0.2226 13.4448 10.3492 158.3318 46.0069 33.5338 5.4588 6.7460 49.1328 69.1236 35.2371 16.6428 0.1649 8.2364 0.2691 0.8543 3.9043 7.8149 16.7088 23.5733 10.3449 21.4131 0.5938 9.9062 5.7107 16.0328 18.3420 2.1063 22.1820 0.2226 0.9566 0.4452 1.0345 0.3087 0.2915 1.2154 6.5059 3.9112 14.7645 83.7908 2.4288 2.4724 96.2547 9.6489 5.2239 7.9250 22.1943 2.8715 49.1026 17.5988 18.6229 26.9274 53.6247 28.0043 0.1353 0.1517 0.3216 21.2485 10.1011 12.0221 1.8420 31.6577 1.7067 2.9573 3.5352 1.8958 4.0812 23.0568 11.6804 2.6862 13.4853 0.4475 0.4056 1.1455 0.9969 0.7930 5.4062 19.6573 2.4718 1.1279 1.5428 0.0745 12.2861 5.6062 5.8474 32.8578 9.2603 3.5212 7.5950 12.9923 6.7736 8.6519 5.9554 33.9998 13.2471 3.2314 0.1320 1.4129 0.4924 11.7090 5.5626 56.2917 172.6234 44.2915 11.7941 72.9578 39.0509 21.9061 65.5695 55.5444 52.1766 42.3546 13.0669 24.9264 3.5730 4.3327 0.4679 5.8697 0.5829 5.1020 34.0629 22.8320 16.0499 27.9683 31.6345 18.9260 44.7866 4.7800 19.4421 9.7977
temp: 298.150 k
press: 1.00000 atm
elementType: 8 8 7 6 6 6 6 6 6 6 6 6 6 6 6 6 6 6 6 6 6 6 6 6 6 6 6 6 6 6 1 1 1 1 1 1 1 1 1 1 1 1 1 1 1 1 1 1 1 1 1 1 1 1 1 1 1 1 1
symmnumber: 1
zpe: 1294222.2 jmol-1
zpe.correction: 0.492943 hartree
zpe.thermalcorrener: 0.518317 hartree
zpe.thermalcorrenthalpy: 0.519261 hartree
zpe.thermalcorrgfe: 0.437369 hartree
zpe.sumelectzpe: -1249.281731 hartree
zpe.sumelectthermal: -1249.256358 hartree
zpe.sumelectthermalent: -1249.255414 hartree
zpe.sumelectthermalfe: -1249.337306 hartree
dipole: 0.8249 2.1079 0.5382
dipole: 2.3267
quadrupole: -168.5047 -164.8833 -171.2562
quadrupole: 0.9405 -0.5467 1.6546
quadrupole: -0.2899 3.3315 -3.0415 0.9405 -0.5467 1.6546
hfenergy: -1249.7746745 hartree
pointgroup: C01 [X(C27H29N1O2)]
dipole: -0.2384042 -0.8494698 0.243944 debye
polarizability: 305.0842809|4.7739547|338.980146|3.6229621|-15.7976519|230.3224394 unknown
InChI: InChI=1S/C27H29NO2/c1-4-12-22(13-5-1)26(23-14-6-2-7-15-23)20-29-27(30-21-26,24-16-8-3-9-17-24)25-18-10-11-19-28-25/h1-9,12-17,25,28H,10-11,18-21H2
charge 0 multiplicity 1
59 atoms
O  0.907358 0.105354 -1.064616
O  0.549674 0.288568 1.321317
N  2.157401 2.301356 0.393066
C  2.67649 0.920444 0.398088
C  1.504801 -0.093288 0.255759
C  -1.447911 -0.110913 -0.119646
C  3.740768 0.770175 -0.713839
C  -0.423089 -0.512384 -1.230077
C  -0.732818 -0.429892 1.226847
C  4.861913 1.821088 -0.526712
C  4.278756 3.252039 -0.442446
C  3.19569 3.31679 0.656169
C  1.978189 -1.544098 0.451551
C  -2.686979 -1.00672 -0.349148
C  -1.849423 1.383146 -0.145565
C  2.181021 -2.046268 1.761354
C  2.293486 -2.363317 -0.659293
C  -3.064113 -2.0674 0.513649
C  -3.023753 1.784891 0.547411
C  -3.474915 -0.778059 -1.510895
C  -1.070138 2.379738 -0.786965
C  2.678039 -3.353641 1.957138
C  2.788945 -3.671992 -0.464798
C  -4.190143 -2.874221 0.223293
C  -3.420715 3.138007 0.587027
C  -4.591721 -1.585002 -1.807557
C  -1.474012 3.735421 -0.75533
C  2.982365 -4.171913 0.843787
C  -4.955822 -2.641624 -0.939453
C  -2.647724 4.122934 -0.072015
H  3.164877 0.664847 1.376781
H  3.240826 0.916245 -1.688706
H  4.169074 -0.248915 -0.69384
H  -0.327968 -1.617679 -1.234474
H  -0.757984 -0.175457 -2.224317
H  -1.32029 -0.082877 2.092054
H  -0.541702 -1.518254 1.316138
H  5.590968 1.747465 -1.356179
H  5.417954 1.600292 0.409055
H  1.326097 2.388425 0.990988
H  5.07911 3.986449 -0.22683
H  3.817204 3.523892 -1.411241
H  3.695054 3.17236 1.650898
H  2.717122 4.313601 0.668087
H  1.936906 -1.407735 2.618032
H  2.153069 -1.963461 -1.669547
H  -2.495293 -2.277322 1.42499
H  -3.642771 1.028439 1.045052
H  -3.221054 0.058225 -2.173071
H  -0.128657 2.108929 -1.273462
H  2.829804 -3.733053 2.97405
H  3.026803 -4.298456 -1.331902
H  -4.466325 -3.68383 0.908517
H  -4.332635 3.422735 1.124585
H  -5.181997 -1.387049 -2.709344
H  -0.857205 4.489197 -1.258241
H  3.368086 -5.186473 0.994833
H  -5.82589 -3.268632 -1.163927
H  -2.955313 5.174769 -0.048682
