program: Gaussian 09
title: 000210683
version: EM64L-G09RevD.01
frameworkgroup: C1[X(C11H16N2O4)]
method: RPBEPBE
basis: SDD
operation: Freq
keyword: #p
keyword: freq=noraman
keyword: PBEPBE/SDD
title: #p freq=noraman PBEPBE/SDD
converged: YES YES NO NO
title: Mulliken charges:
elementType: O O O O N N C C C C C C C C C C C H H H H H H H H H H H H H H H H
charge: -0.445939 -0.253116 -0.220994 -0.237268 -0.185635 -0.368116 0.123369 -0.488517 -0.540832 0.197356 -0.061655 0.144453 0.191345 -0.722311 -0.022929 -0.596499 -0.595515 0.249244 0.235732 0.226320 0.255458 0.250112 0.364342 0.209395 0.241897 0.220793 0.263171 0.251548 0.254589 0.267564 0.350907 0.221929 0.219802
chargesum: 0.00000
title: Mulliken charges with hydrogens summed into heavy atoms:
elementType: O O O O N N C C C C C C C C C C C
charge: -0.095032 -0.253116 -0.220994 -0.237268 -0.185635 -0.003774 0.123369 -0.003541 -0.059053 0.197356 0.188456 0.144453 0.191345 -0.050226 0.240243 0.177202 -0.153785
polarizability: 1.78584543e+02 -1.03887305e+01 1.22330552e+02 -1.92804666e+00 -6.62077331e+00 1.33738780e+02
1716.lowfreq: -11.8463 -6.4734 -0.0002 0.0004 0.0008 7.2076 29.8761 57.7014 66.1486
frequency: 29.7791 57.4562 66.1454 71.8246 78.4203 85.5472 102.5868 140.4960 151.0511 163.9619 201.7679 230.2571 248.4460 264.6516 277.7704 287.2573 333.3910 343.8500 376.3836 387.5316 414.3348 432.9309 444.1701 454.3606 490.6886 512.8250 583.0011 626.2722 660.9977 673.8010 711.2278 714.0730 737.3541 778.7201 803.1303 831.8635 891.1686 901.3751 931.5300 936.3270 954.3647 975.5294 986.9395 1009.7809 1033.1038 1067.2362 1082.5080 1102.2564 1127.8324 1142.7574 1159.9072 1175.6203 1209.9510 1243.5021 1265.1643 1289.8586 1295.7579 1302.0385 1317.6108 1330.9404 1356.9786 1363.2139 1379.3069 1382.0279 1386.5594 1427.8921 1431.1739 1436.7032 1460.1944 1467.9271 1468.5352 1472.3198 1484.1169 1572.8662 1637.9051 1655.8469 1656.3878 2963.7625 2976.5276 3013.9235 3017.7096 3046.1814 3047.6888 3070.2350 3084.9121 3087.2686 3095.7505 3111.5893 3119.9956 3150.1093 3196.9627 3518.1633 3528.2654
redmass: 7.3327 4.1586 3.2747 3.2293 2.8760 1.0974 3.5406 4.6538 4.1839 7.2810 4.4714 1.0941 4.0546 2.9739 3.5195 3.3704 3.3590 3.1213 6.8458 6.0409 2.3015 2.6233 1.9061 2.1780 2.7510 3.9778 4.8357 2.0131 2.7039 4.5409 6.9611 5.9576 3.9974 1.8094 3.5809 2.3173 1.6548 2.9024 1.7541 2.4471 1.3614 1.6737 3.1123 1.1545 1.8600 2.3955 3.3028 1.9798 1.3186 2.2749 2.4446 3.8125 1.5356 2.3296 1.8308 1.3636 1.2988 1.3074 1.4711 3.0236 1.5588 3.6826 1.8562 1.2206 1.2177 1.1836 1.2568 1.1140 1.1034 1.0669 1.0609 1.0501 1.0798 9.8355 6.7288 6.6981 4.7935 1.0630 1.0372 1.0601 1.0341 1.0891 1.0961 1.0994 1.0999 1.0611 1.0993 1.1009 1.0938 1.1027 1.1141 1.0767 1.0657
irintensity: 1.9156 2.3977 0.5359 1.1689 0.6080 0.2252 0.8437 0.6172 1.2203 19.6723 5.2669 0.2915 6.1812 1.8733 1.0666 6.7833 4.2593 5.7304 31.6831 22.5293 2.8330 81.4437 54.7221 64.5263 63.5284 23.1130 2.6053 5.9341 26.3285 2.2013 1.7972 7.8006 6.0387 102.8984 9.9735 2.0788 2.1154 2.2812 6.1883 19.5207 79.8422 15.7688 23.3895 13.3621 69.3889 36.2223 9.9115 1.6691 1.6184 20.4677 15.7957 39.9827 24.9511 2.5153 20.0789 3.8332 23.7575 5.4002 31.5640 255.9138 50.6696 136.0659 17.5175 41.9236 11.2772 50.0086 62.6989 45.1048 21.6540 15.9173 16.9729 11.0827 12.9389 335.7912 258.4423 320.8444 29.7630 18.8258 19.2843 10.0264 20.1648 1.7468 8.3561 16.3562 23.4663 10.1055 25.2580 13.5914 3.7552 0.4814 19.5132 66.2720 7.1363
temp: 298.150 k
press: 1.00000 atm
elementType: 8 8 8 8 7 7 6 6 6 6 6 6 6 6 6 6 6 1 1 1 1 1 1 1 1 1 1 1 1 1 1 1 1
symmnumber: 1
zpe: 691264.4 jmol-1
zpe.correction: 0.263289 hartree
zpe.thermalcorrener: 0.281334 hartree
zpe.thermalcorrenthalpy: 0.282278 hartree
zpe.thermalcorrgfe: 0.217022 hartree
zpe.sumelectzpe: -837.888454 hartree
zpe.sumelectthermal: -837.870409 hartree
zpe.sumelectthermalent: -837.869465 hartree
zpe.sumelectthermalfe: -837.934721 hartree
dipole: -1.8775 1.2769 -1.0631
dipole: 2.5071
quadrupole: -104.1716 -101.2599 -104.0014
quadrupole: 2.8694 -1.4508 2.0409
quadrupole: -1.0273 1.8844 -0.8571 2.8694 -1.4508 2.0409
hfenergy: -838.151743 hartree
pointgroup: C01 [X(C11H16N2O4)]
dipole: -0.6420648 0.6936949 -0.2818915 debye
polarizability: 171.1619736|-20.4285582|130.5406675|-8.7320215|-5.184283|132.9512336 unknown
InChI: InChI=1S/C11H16N2O4/c1-4-5-11(6-7(2)14)8(15)12-10(17)13(3)9(11)16/h4,7,12,14H,1,5-6H2,2-3H3
charge 0 multiplicity 1
33 atoms
O  -0.829668 -2.070489 -1.174649
O  -0.095573 0.73131 -1.964162
O  -0.354018 -0.863461 2.594776
O  3.645849 -0.929569 0.265385
N  1.790671 0.010202 -0.835106
N  1.616921 -0.834696 1.389405
C  -0.385657 0.30259 0.433299
C  -1.825894 -0.211704 0.164338
C  -0.432661 1.794531 0.994063
C  0.414834 0.327376 -0.879468
C  -1.883171 -1.71612 -0.189551
C  0.261828 -0.524197 1.549504
C  2.432442 -0.600123 0.265648
C  -3.273355 -2.138007 -0.688865
C  -1.211436 2.765566 0.132418
C  2.575228 0.181567 -2.081551
C  -2.232318 3.529619 0.594854
H  -2.249743 0.392131 -0.658504
H  -2.436103 -0.0333 1.067938
H  0.612173 2.151349 1.110622
H  -0.878764 1.742537 2.004288
H  -1.605496 -2.315517 0.694385
H  2.077666 -1.330059 2.160003
H  -3.561051 -1.566811 -1.59269
H  -3.279373 -3.212976 -0.937373
H  -4.040982 -1.955199 0.085409
H  -0.900207 2.850859 -0.917419
H  2.410887 1.1943 -2.480018
H  2.248501 -0.550778 -2.838656
H  3.635085 0.021125 -1.839937
H  -1.015516 -1.586521 -2.022025
H  -2.748476 4.245818 -0.054127
H  -2.578221 3.466748 1.634564
