program: Gaussian 09
title: 000210682
version: EM64L-G09RevD.01
frameworkgroup: C1[X(C19H20F3N3O)]
method: RPBEPBE
basis: SDD
operation: Freq
keyword: #p
keyword: freq=noraman
keyword: PBEPBE/SDD
title: #p freq=noraman PBEPBE/SDD
converged: YES YES NO NO
title: Mulliken charges:
elementType: F F F O N N N C C C C C C C C C C C C C C C C C C C H H H H H H H H H H H H H H H H H H H H
charge: -0.164426 -0.164691 -0.171817 -0.251393 -0.304612 -0.079950 -0.097682 0.294220 0.018231 -0.414550 -0.331498 0.120456 -0.274339 0.469353 -0.298593 -0.341778 -0.488413 -0.391208 -0.224541 -0.241134 0.324977 -0.614595 -0.625659 -0.187450 -0.378804 0.244229 0.223005 0.232766 0.205897 0.174049 0.221461 0.219839 0.244967 0.259384 0.262493 0.286786 0.230028 0.231578 0.224959 0.187195 0.224132 0.221546 0.185824 0.236970 0.237317 0.265474
chargesum: 0.00000
title: Mulliken charges with hydrogens summed into heavy atoms:
elementType: F F F O N N N C C C C C C C C C C C C C C C C C C C
charge: -0.164426 -0.164691 -0.171817 -0.251393 -0.304612 -0.079950 -0.097682 0.294220 0.018231 0.041221 0.048448 0.120456 0.166961 0.469353 -0.053626 -0.082394 -0.225920 -0.104423 0.005487 -0.009556 0.324977 0.021691 0.018680 0.049867 -0.113330 0.244229
polarizability: 3.23472688e+02 2.16710083e+01 2.94433180e+02 -7.20960602e-01 1.60259982e+01 1.28255369e+02
1716.lowfreq: -2.0581 -0.0010 -0.0006 0.0002 0.6736 6.1122 12.4998 16.4479 29.6159
frequency: 12.3468 16.3712 29.5894 33.1888 40.9791 60.7190 68.7146 82.0135 100.1066 115.1635 127.5007 136.1261 154.7848 175.2088 196.4962 220.1571 229.3030 238.9632 245.1972 256.5265 286.4022 305.8350 318.7154 337.7239 343.7186 372.7954 385.9819 409.7448 423.8264 430.1884 439.9036 478.7187 482.7618 519.0012 558.5712 571.1699 577.7563 606.9819 619.9094 633.4278 642.4744 668.7634 695.9383 727.8658 747.8796 759.2141 761.3283 772.8887 804.9451 808.2621 824.4478 857.6979 870.9089 888.1638 920.4675 922.6721 950.0301 950.5306 983.1909 984.7806 986.6701 990.7063 1010.5062 1016.0294 1023.5820 1034.0985 1035.1478 1067.9277 1074.3582 1085.1521 1093.3662 1098.9358 1103.5449 1106.2740 1142.3336 1148.4885 1171.2619 1174.2369 1182.7562 1204.2008 1219.5157 1259.7382 1269.3077 1269.8152 1279.8042 1292.5086 1300.0325 1314.7285 1351.4724 1367.7284 1381.3276 1387.0675 1397.6203 1412.5035 1420.7961 1427.1773 1444.6133 1453.1467 1462.6553 1463.5801 1472.6236 1476.6700 1478.8712 1479.8715 1484.4155 1489.5902 1492.3002 1509.1759 1583.1062 1598.4161 1620.0093 1625.7663 2814.8410 2843.3777 2859.7729 2982.6746 3000.1833 3012.8169 3019.7861 3033.2769 3040.6151 3078.3881 3082.3685 3090.6800 3137.8003 3149.8317 3153.5764 3171.9565 3176.0122 3183.7299 3191.2937 3199.0877
redmass: 16.5646 6.5896 5.4440 4.3887 2.7020 5.2501 6.2488 3.5552 1.8275 4.1406 6.7867 2.3649 4.8487 4.6206 5.9285 4.9731 1.3458 1.6379 3.1088 2.6361 4.3048 7.1247 3.9972 3.1070 4.5527 4.0855 6.6392 5.9796 3.3281 4.5770 2.6325 3.0327 5.0902 10.4389 5.0888 7.0083 5.6305 11.7768 6.6121 6.2107 6.8191 7.5562 2.1449 8.9245 3.1105 5.0985 1.6836 1.1192 1.9745 2.6508 6.6423 1.3834 1.2194 1.5169 1.6361 4.1902 1.6713 3.7456 7.5959 3.4816 1.6359 1.3611 4.9522 2.7448 2.5125 1.7250 3.6632 2.9775 3.3519 2.5136 1.3694 1.5992 1.7403 2.6288 1.5300 1.6621 1.2330 1.4217 1.1272 2.3934 1.7967 1.9288 2.5985 1.4597 1.6567 1.2495 1.3353 1.4000 1.8477 2.4282 1.6761 2.7252 7.9110 5.3277 1.1485 2.8694 1.1676 4.0755 1.0601 1.0590 1.1202 1.0715 3.2479 1.0700 1.1197 1.4434 1.7741 4.5303 6.7817 7.0200 6.6007 7.2877 1.0705 1.0576 1.0576 1.0568 1.0841 1.0609 1.0719 1.0717 1.1062 1.1016 1.1046 1.1006 1.0864 1.0883 1.0907 1.0975 1.0946 1.0968 1.0958 1.0916
irintensity: 0.0339 0.5577 0.2113 0.4784 1.2375 0.7111 1.8933 1.1205 1.0000 1.0111 0.5238 2.4742 0.8197 0.9649 1.0866 0.7787 1.8503 0.1048 1.4440 0.4438 0.2271 1.4256 11.7856 5.5918 9.6191 0.3906 1.2574 6.9805 5.1164 1.5694 2.3734 13.8388 2.7859 0.5425 3.7600 2.1862 1.6364 21.4192 2.3101 13.2742 6.3455 18.9581 27.5428 57.1002 32.0232 19.3643 43.9862 4.4068 85.6018 4.3898 6.7309 0.0094 0.4300 34.5213 21.7411 82.2939 5.5720 19.0904 158.9846 65.7282 10.0863 0.8390 144.2107 7.6327 1.8654 41.0675 155.1402 24.2885 15.5892 29.9640 5.2584 19.3898 10.5133 29.0263 6.2200 49.1159 2.3061 4.5876 1.1318 12.0597 6.4579 10.0695 263.5356 50.8706 26.8749 1.6845 4.7869 39.5466 146.7569 79.9396 94.6106 33.4744 0.1520 12.7849 4.8522 93.1072 3.6868 102.5897 8.2090 17.4099 52.4685 8.6165 0.7611 11.9842 2.9699 40.3127 97.8518 479.5573 6.7226 28.6960 125.1160 36.3284 78.8429 71.0824 219.7408 12.4456 19.0670 24.9232 45.6452 43.4142 10.1469 21.7923 60.2260 45.5757 2.8947 11.1187 11.0803 20.8266 2.1590 7.8380 2.0712 0.2913
temp: 298.150 k
press: 1.00000 atm
elementType: 9 9 9 8 7 7 7 6 6 6 6 6 6 6 6 6 6 6 6 6 6 6 6 6 6 6 1 1 1 1 1 1 1 1 1 1 1 1 1 1 1 1 1 1 1 1
symmnumber: 1
zpe: 936931.1 jmol-1
zpe.correction: 0.356858 hartree
zpe.thermalcorrener: 0.381363 hartree
zpe.thermalcorrenthalpy: 0.382307 hartree
zpe.thermalcorrgfe: 0.298833 hartree
zpe.sumelectzpe: -1273.097443 hartree
zpe.sumelectthermal: -1273.072938 hartree
zpe.sumelectthermalent: -1273.071994 hartree
zpe.sumelectthermalfe: -1273.155468 hartree
dipole: 4.3413 -0.6452 -0.5893
dipole: 4.4284
quadrupole: -164.1091 -133.1982 -157.1899
quadrupole: -9.9928 10.9589 4.4350
quadrupole: -12.6100 18.3008 -5.6908 -9.9928 10.9589 4.4350
hfenergy: -1273.4543011 hartree
pointgroup: C01 [X(C19H20F3N3O1)]
dipole: -1.711737 -0.24752 0.2101371 debye
polarizability: 323.3380504|-21.5094859|294.278311|2.1113446|-17.6585813|128.5448742 unknown
InChI: InChI=1S/C19H20F3N3O/c1-24(2)11-6-12-26-18-16-9-3-4-10-17(16)25(23-18)15-8-5-7-14(13-15)19(20,21)22/h3-5,7-10,13H,6,11-12H2,1-2H3
charge 0 multiplicity 1
46 atoms
F  6.413942 -1.875241 0.326597
F  5.650608 -1.475707 -1.766041
F  5.781329 0.22325 -0.275541
O  -2.747618 0.969158 -0.019543
N  0.70762 0.276774 0.22346
N  -7.175105 -1.218007 -0.09328
N  -0.64429 -0.165937 0.177466
C  0.783397 1.68283 0.176345
C  -0.567318 2.154988 0.065267
C  -4.916126 -0.100356 -0.125231
C  -5.710117 -1.424272 -0.170607
C  -1.378592 0.960163 0.071962
C  -3.417082 -0.362617 0.010551
C  1.720347 -0.709518 0.323746
C  1.861304 2.599732 0.273303
C  -0.859856 3.536951 0.006865
C  3.052806 -0.436301 -0.07068
C  1.383374 -2.004377 0.804081
C  1.551315 3.972835 0.219102
C  0.212857 4.444337 0.076653
C  4.037136 -1.438842 0.065607
C  -7.892705 -2.487094 0.149333
C  -7.726485 -0.494054 -1.257453
C  2.378652 -2.992528 0.92129
C  3.717893 -2.721929 0.563722
C  5.436683 -1.147905 -0.394015
H  -5.085069 0.493446 -1.041815
H  -5.271317 0.498995 0.732338
H  -5.420226 -2.047216 0.699085
H  -5.42101 -1.999862 -1.091978
H  -3.016813 -0.975916 -0.820236
H  -3.161651 -0.861393 0.965539
H  2.896657 2.283468 0.414847
H  -1.895549 3.878872 -0.079698
H  3.324587 0.524128 -0.510986
H  0.345385 -2.207261 1.075764
H  2.367289 4.700061 0.295076
H  0.024691 5.52201 0.034682
H  -7.513079 -2.958779 1.073406
H  -7.788326 -3.227205 -0.68554
H  -8.969296 -2.282962 0.288626
H  -8.816799 -0.374538 -1.129166
H  -7.547647 -1.023448 -2.229199
H  -7.286775 0.514634 -1.32949
H  2.10999 -3.982949 1.3023
H  4.495089 -3.483422 0.672087
