program: Gaussian 09
title: 000210680
version: EM64L-G09RevD.01
frameworkgroup: C1[X(C18H18F3N3O)]
method: RPBEPBE
basis: SDD
operation: Freq
keyword: #p
keyword: freq=noraman
keyword: PBEPBE/SDD
title: #p freq=noraman PBEPBE/SDD
converged: YES YES NO NO
title: Mulliken charges:
elementType: F F F O N N N C C C C C C C C C C C C C C C C C C H H H H H H H H H H H H H H H H H H
charge: -0.164627 -0.164465 -0.171967 -0.256210 -0.305110 -0.094336 -0.093288 0.292957 0.020275 0.121229 0.470084 -0.265734 -0.372255 -0.296786 -0.341737 -0.493268 -0.391163 0.326390 -0.225080 -0.240819 -0.187678 -0.374420 -0.614431 -0.613507 0.243877 0.242601 0.220820 0.200714 0.224427 0.244708 0.258339 0.262576 0.287953 0.229997 0.231309 0.237624 0.264759 0.229817 0.190667 0.223729 0.227826 0.192730 0.221473
chargesum: 0.00000
title: Mulliken charges with hydrogens summed into heavy atoms:
elementType: F F F O N N N C C C C C C C C C C C C C C C C C C
charge: -0.164627 -0.164465 -0.171967 -0.256210 -0.305110 -0.094336 -0.093288 0.292957 0.020275 0.121229 0.470084 0.197686 0.052886 -0.052078 -0.083398 -0.230692 -0.103210 0.326390 0.004917 -0.009509 0.049946 -0.109661 0.029783 0.028522 0.243877
polarizability: 3.08354404e+02 2.04939818e+01 2.82672559e+02 4.34688172e+00 1.16341805e+01 1.20941414e+02
1716.lowfreq: -8.6426 -3.6817 -0.7646 -0.0008 -0.0005 -0.0001 14.1265 16.2713 22.6348
frequency: 13.4546 15.6621 22.3373 32.4076 36.7002 60.7378 71.8583 92.8796 105.6329 127.3223 149.5935 165.2565 179.3144 202.8616 216.8603 220.5038 232.8930 244.1415 274.8371 292.5393 306.1768 333.7720 343.3895 365.2994 384.3907 405.1325 422.7904 427.5182 431.2298 450.1769 482.8317 519.0333 558.2221 570.7153 575.4172 607.0198 619.4098 633.9789 643.0978 667.1883 695.2232 725.5811 747.7832 758.5201 761.3476 796.2309 804.1004 808.3262 842.1978 857.4876 888.4165 919.2491 921.1202 949.5476 950.3880 983.6929 985.0041 986.4418 990.6157 1011.3433 1016.6210 1032.1897 1034.3546 1035.9991 1060.3021 1072.7450 1088.7387 1092.7751 1103.6325 1107.2638 1138.5325 1149.0693 1164.3279 1170.9542 1183.2232 1204.5683 1240.1041 1266.7610 1270.3280 1280.1530 1287.6321 1314.7234 1319.0445 1361.8736 1376.8026 1388.8665 1397.6262 1412.9243 1419.9183 1427.5127 1442.9322 1453.4933 1461.4709 1467.8341 1469.9320 1477.2070 1479.4187 1482.3112 1486.3177 1491.3719 1508.9510 1583.1961 1598.1615 1620.5134 1626.2444 2855.1644 2863.9552 2887.5051 3005.4073 3021.9525 3029.3443 3045.6891 3078.8275 3083.1227 3086.7312 3137.9198 3149.8889 3153.2797 3171.4389 3174.6410 3184.1122 3191.5610 3201.8992
redmass: 9.4168 5.6618 3.2619 4.9998 4.3797 5.2042 5.6004 2.9448 2.3652 7.0241 4.8272 3.4127 4.7932 3.9758 1.1439 4.8703 1.3858 5.9919 4.1007 4.8825 7.0832 3.8947 7.9120 2.8324 7.2581 5.2562 3.1422 3.2494 3.4516 3.2914 5.1893 10.4084 5.2581 6.1745 6.5424 11.6875 6.6008 6.1644 6.8022 7.6733 2.1306 9.2264 3.0103 4.9768 1.7409 1.8656 1.6123 1.8636 4.8347 1.3850 1.5169 1.9837 2.9489 1.4469 5.8025 5.1535 2.6567 2.1975 1.3556 4.9881 2.7274 2.6505 2.4349 1.9651 1.6077 3.9609 1.6619 1.8307 1.7105 2.7945 1.4416 1.6675 1.3699 1.2404 1.1244 2.3812 1.7285 2.5101 3.0731 1.6347 1.2661 1.3858 1.4217 2.8194 2.1233 2.5591 7.0766 5.1212 1.2013 2.6538 1.1625 4.0666 1.0538 1.0762 1.1084 1.0532 3.3598 1.0978 1.0664 2.9536 5.4091 6.7524 7.0182 6.5718 7.3578 1.0567 1.0585 1.0684 1.0582 1.0732 1.0725 1.0895 1.1037 1.1033 1.1017 1.0863 1.0882 1.0906 1.0975 1.0949 1.0968 1.0958 1.0913
irintensity: 0.0427 0.3767 0.0197 0.0208 2.1462 0.3594 1.6597 0.9944 4.6048 0.3617 0.3076 1.7146 0.5496 0.6198 1.3997 0.7377 1.2371 1.1005 1.8229 0.9892 2.3399 14.8050 8.4413 2.0174 1.2134 4.2816 3.7768 3.6378 4.8336 11.4721 1.5807 0.7150 4.0971 1.3866 2.3812 20.8498 2.0994 13.1733 6.5157 22.1367 28.6627 60.1316 32.2874 19.3171 41.4782 1.9120 42.3551 32.9338 11.7827 0.0276 36.0405 39.1967 72.5228 1.3954 15.9956 88.6517 110.1516 36.3445 0.3524 146.6414 7.2325 30.2668 148.8733 59.9472 4.9471 45.4349 12.5425 12.3974 7.8529 25.6430 4.7342 49.6557 5.6155 2.1875 1.0944 11.2833 6.6150 23.4383 323.1516 16.8499 4.9801 50.9165 47.2249 21.3316 130.2663 26.8625 1.0970 15.6146 19.1754 109.7366 3.7208 105.6207 10.4556 11.2452 30.7253 14.8486 1.4292 43.3622 9.3476 56.5377 561.1260 7.1199 28.4222 125.3131 35.9474 69.8387 160.5888 124.9824 12.9012 40.4780 45.5972 6.1237 3.1439 63.8043 49.4765 2.6616 10.5656 10.7915 21.9203 2.6355 8.0653 1.7803 0.2475
temp: 298.150 k
press: 1.00000 atm
elementType: 9 9 9 8 7 7 7 6 6 6 6 6 6 6 6 6 6 6 6 6 6 6 6 6 6 1 1 1 1 1 1 1 1 1 1 1 1 1 1 1 1 1 1
symmnumber: 1
zpe: 862977.4 jmol-1
zpe.correction: 0.328691 hartree
zpe.thermalcorrener: 0.351949 hartree
zpe.thermalcorrenthalpy: 0.352893 hartree
zpe.thermalcorrgfe: 0.271931 hartree
zpe.sumelectzpe: -1233.873750 hartree
zpe.sumelectthermal: -1233.850491 hartree
zpe.sumelectthermalent: -1233.849547 hartree
zpe.sumelectthermalfe: -1233.930510 hartree
dipole: 5.0503 0.0633 -1.4551
dipole: 5.2561
quadrupole: -147.8374 -128.9782 -149.6115
quadrupole: -4.1891 3.9350 4.5341
quadrupole: -5.6950 13.1642 -7.4692 -4.1891 3.9350 4.5341
hfenergy: -1234.2024405 hartree
pointgroup: C01 [X(C18H18F3N3O1)]
dipole: -1.9759768 -0.0130164 0.6096133 debye
polarizability: 308.8867972|-20.4500237|282.7383127|0.3701846|-6.7214373|120.343267 unknown
InChI: InChI=1S/C18H18F3N3O/c1-23(2)10-11-25-17-15-8-3-4-9-16(15)24(22-17)14-7-5-6-13(12-14)18(19,20)21/h3-9,12H,10-11H2,1-2H3
charge 0 multiplicity 1
43 atoms
F  6.122151 -1.499448 0.238881
F  5.378127 -1.126702 -1.864778
F  5.338218 0.552271 -0.345813
O  -3.200271 0.71643 -0.048257
N  0.290847 0.234532 0.175993
N  -1.029201 -0.29015 0.089683
N  -5.981965 -1.775102 -0.27214
C  0.27568 1.642476 0.220933
C  -1.102339 2.033058 0.128912
C  -1.834424 0.790482 0.051912
C  1.364715 -0.689834 0.215271
C  -3.780644 -0.654031 -0.126251
C  -5.295993 -0.462957 -0.260761
C  1.291429 2.618856 0.385669
C  -1.482898 3.394312 0.155681
C  2.678768 -0.304368 -0.145959
C  1.109397 -2.034805 0.59779
C  3.724795 -1.248927 -0.072703
C  0.893958 3.969916 0.416126
C  -0.471501 4.362522 0.292156
C  2.165835 -2.963214 0.653684
C  3.486572 -2.582547 0.329624
C  -7.245676 -1.764105 -1.036399
C  -6.158085 -2.351325 1.077072
C  5.106368 -0.83902 -0.494208
H  -3.36264 -1.182304 -1.001143
H  -3.498429 -1.208591 0.787961
H  -5.657788 0.207415 0.557171
H  -5.497317 0.054413 -1.215878
H  2.344402 2.361485 0.5161
H  -2.538017 3.674004 0.080873
H  2.891054 0.700089 -0.514192
H  0.084946 -2.323345 0.841967
H  1.660986 4.741606 0.544956
H  -0.728816 5.426394 0.316303
H  1.959178 -3.993845 0.959198
H  4.31029 -3.299273 0.390812
H  -7.056711 -1.419798 -2.068271
H  -8.034309 -1.107678 -0.588587
H  -7.651623 -2.790347 -1.090489
H  -6.565065 -3.374525 0.991698
H  -6.852779 -1.753273 1.720271
H  -5.187823 -2.420748 1.598337
