program: Gaussian 09
title: 000210678
version: EM64L-G09RevD.01
frameworkgroup: C1[X(C15H11F3N2O)]
method: RPBEPBE
basis: SDD
operation: Freq
keyword: #p
keyword: freq=noraman
keyword: PBEPBE/SDD
title: #p freq=noraman PBEPBE/SDD
converged: NO YES NO NO
title: Mulliken charges:
elementType: F F F O N N C C C C C C C C C C C C C C C H H H H H H H H H H H
charge: -0.162917 -0.165845 -0.170968 -0.253347 -0.308733 -0.092842 0.294012 0.047844 0.474779 0.090533 -0.298094 -0.469932 -0.338905 0.323848 -0.389360 -0.223145 -0.238823 -0.403544 -0.184786 0.241882 -0.511321 0.248220 0.265636 0.259715 0.285449 0.230424 0.231739 0.268530 0.237816 0.240601 0.235989 0.235543
chargesum: 0.00000
title: Mulliken charges with hydrogens summed into heavy atoms:
elementType: F F F O N N C C C C C C C C C C C C C C C
charge: -0.162917 -0.165845 -0.170968 -0.253347 -0.308733 -0.092842 0.294012 0.047844 0.474779 0.090533 -0.049874 -0.204295 -0.079189 0.323848 -0.103911 0.007279 -0.007083 -0.135014 0.053030 0.241882 0.200813
polarizability: 2.67152235e+02 2.23529951e+01 2.22080861e+02 1.10758941e+01 3.72164092e+00 8.66698215e+01
1716.lowfreq: -10.7593 -3.4633 -0.0002 0.0004 0.0010 4.2852 8.2107 28.2403 59.1979
frequency: -8.6574 28.1789 59.1936 63.0724 90.6335 127.5974 132.5573 149.1366 166.8014 195.8356 220.7472 242.0995 265.4372 292.6224 304.0398 336.0756 346.8810 384.2304 410.6312 424.3683 432.4768 480.0021 517.0604 537.9972 559.9247 570.6248 606.9970 616.7469 633.9115 642.0340 662.3790 693.4409 715.8871 747.3773 758.1009 762.1506 801.7682 808.9715 857.6610 882.0655 923.0421 930.3152 950.1840 956.0581 981.8663 984.0591 986.2584 991.8309 1006.9690 1014.9516 1039.0844 1076.4547 1098.7466 1104.2235 1116.6046 1145.7820 1161.8059 1171.9027 1183.1512 1205.8405 1269.0864 1279.8463 1315.1011 1362.5586 1383.3283 1396.5480 1400.4842 1412.6671 1439.2577 1450.3100 1452.1301 1466.2212 1480.4759 1492.1438 1515.6295 1584.1361 1599.8087 1619.1087 1626.2555 2991.7159 3089.1076 3138.1158 3144.6030 3150.7548 3153.7941 3171.8662 3178.9995 3181.0412 3189.6754 3191.8078
redmass: 15.5628 5.9677 5.4399 6.4842 3.3377 6.8983 4.4978 1.3886 3.2524 3.4160 5.3611 5.0678 9.6023 5.1223 6.8398 6.8917 6.2204 7.2698 6.5605 3.1897 4.8869 5.1436 9.5010 6.1461 5.1536 6.6586 11.4016 6.6826 6.1991 6.9136 7.1038 2.2230 8.0707 3.0570 5.1924 1.6847 3.2841 1.8612 1.3953 1.5240 1.4101 7.6234 1.3755 7.5279 7.7045 3.6927 1.5204 1.3963 5.6779 2.4138 5.5072 3.9175 2.6016 1.7125 1.2539 1.5415 1.5545 1.2188 1.1224 2.5133 2.9737 1.6535 1.4072 3.2628 3.5169 4.4432 2.2202 5.4009 2.1073 3.2916 1.0749 1.0665 3.2333 3.0891 4.6853 6.8457 6.9869 6.4108 7.5137 1.0301 1.1045 1.0864 1.1039 1.0885 1.0905 1.0970 1.0939 1.0967 1.0933 1.0957
irintensity: 0.0423 0.8745 0.7497 0.8536 6.9844 0.4405 4.6145 0.9166 1.3366 1.1181 0.7825 1.0592 0.8803 5.7133 1.7370 8.8790 4.2535 1.8774 6.3388 5.9963 0.6196 1.7322 0.2496 3.5404 5.0721 2.9022 18.2581 4.4082 13.9570 8.2057 19.3069 26.3142 35.8504 31.8179 15.7547 46.3534 41.0512 50.3764 0.2405 26.5956 7.6028 29.0130 0.5705 13.3187 207.2417 20.2550 5.2272 3.5858 139.4983 16.7114 151.7568 22.0853 27.0940 1.9818 0.0458 13.4258 33.7059 4.8223 1.5361 10.0852 291.5563 18.4535 44.5465 25.9358 164.2008 24.9881 56.7441 8.0202 46.1089 136.7005 19.5214 28.4929 2.8665 72.4415 453.9186 5.2408 29.3298 127.2274 29.1883 44.2128 30.8744 2.7990 21.6371 12.0678 10.3128 20.5139 0.8208 6.0828 3.5151 0.4507
temp: 298.150 k
press: 1.00000 atm
elementType: 9 9 9 8 7 7 6 6 6 6 6 6 6 6 6 6 6 6 6 6 6 1 1 1 1 1 1 1 1 1 1 1
symmnumber: 1
zpe: 602220.6 jmol-1
zpe.correction: 0.229374 hartree
zpe.thermalcorrener: 0.246177 hartree
zpe.thermalcorrenthalpy: 0.247121 hartree
zpe.thermalcorrgfe: 0.184259 hartree
zpe.sumelectzpe: -1060.958067 hartree
zpe.sumelectthermal: -1060.941264 hartree
zpe.sumelectthermalent: -1060.940320 hartree
zpe.sumelectthermalfe: -1061.003182 hartree
dipole: 3.3191 -2.0723 -0.9624
dipole: 4.0295
quadrupole: -124.4185 -101.0629 -124.8672
quadrupole: 4.4002 4.4604 0.3972
quadrupole: -7.6356 15.7199 -8.0844 4.4002 4.4604 0.3972
hfenergy: -1061.1874407 hartree
pointgroup: C01 [X(C15H11F3N2O1)]
dipole: -1.2829386 -0.8549514 0.3693263 debye
polarizability: 268.32449|-21.0174828|220.8278244|11.9317869|-2.9510184|86.7506032 unknown
InChI: InChI=1S/C15H11F3N2O/c1-21-14-12-7-2-3-8-13(12)20(19-14)11-6-4-5-10(9-11)15(16,17)18/h2-9H,1H3
charge 0 multiplicity 1
32 atoms
F  5.30567 0.139144 0.055599
F  4.060166 0.935062 -1.664055
F  3.857607 1.854965 0.392024
O  -4.167738 -1.472989 -0.427495
N  -0.820808 -0.464669 0.074961
N  -1.789567 -1.487202 -0.121827
C  -1.427493 0.805082 0.134706
C  -2.832531 0.59054 -0.063079
C  0.53692 -0.853056 0.198264
C  -2.968427 -0.839369 -0.212702
C  -0.924214 2.105647 0.392632
C  1.585865 0.049552 -0.098461
C  -3.747459 1.668625 -0.050858
C  2.926637 -0.370406 0.052859
C  0.84573 -2.182322 0.59787
C  -1.850386 3.166637 0.408302
C  -3.243454 2.961699 0.178918
C  3.244609 -1.679994 0.472191
C  2.187898 -2.58186 0.73171
C  4.016768 0.608117 -0.277907
C  -4.102553 -2.943602 -0.567632
H  0.129505 2.300183 0.603359
H  1.373951 1.048109 -0.485769
H  -4.815299 1.488814 -0.206942
H  0.023733 -2.874757 0.791482
H  -1.486897 4.180548 0.608864
H  -3.922061 3.82065 0.19568
H  4.287678 -1.986301 0.586604
H  2.415385 -3.605136 1.047023
H  -3.448647 -3.219508 -1.413531
H  -5.140424 -3.254436 -0.751835
H  -3.711362 -3.400068 0.358848
