program: Gaussian 09
title: 000210677
version: EM64L-G09RevD.01
frameworkgroup: C1[X(C14H9F3N2O)]
method: RPBEPBE
basis: SDD
operation: Freq
keyword: #p
keyword: freq=noraman
keyword: PBEPBE/SDD
title: #p freq=noraman PBEPBE/SDD
converged: YES YES NO NO
title: Mulliken charges:
elementType: F F F O N N C C C C C C C C C C C C C C H H H H H H H H H
charge: -0.162434 -0.163541 -0.163671 -0.249648 -0.213112 -0.365370 0.305172 0.024579 0.451780 0.124859 -0.525644 -0.301866 -0.332032 -0.388705 0.338897 -0.211406 -0.240639 -0.199731 -0.367221 0.254747 0.337408 0.297033 0.245299 0.259532 0.267494 0.230705 0.269476 0.241781 0.236258
chargesum: 0.00000
title: Mulliken charges with hydrogens summed into heavy atoms:
elementType: F F F O N N C C C C C C C C C C C C C C
charge: -0.162434 -0.163541 -0.163671 -0.249648 -0.213112 -0.027963 0.305172 0.024579 0.451780 0.124859 -0.228611 -0.056567 -0.064538 -0.129173 0.338897 0.019299 -0.004381 0.042050 -0.097745 0.254747
polarizability: 2.75163046e+02 1.77064015e+01 1.88028849e+02 1.69311796e+01 -1.56996757e+00 8.39941767e+01
1716.lowfreq: -4.1011 -0.0010 -0.0009 -0.0007 0.3545 5.6899 10.2422 26.1645 49.6285
frequency: 10.1833 26.1302 49.6210 81.2807 124.9359 137.9183 162.2053 207.6026 217.5059 236.9793 280.1747 306.1649 316.4027 331.9860 347.5930 405.1072 418.3374 428.4982 459.1446 484.0589 517.9875 530.1454 542.0971 582.0727 594.9153 610.0247 635.7524 654.8882 660.6549 698.1932 735.4386 748.0851 752.6478 770.7947 789.3451 801.9523 863.8764 907.9513 911.6367 940.2624 957.5770 979.4395 985.8147 986.7245 990.5972 1015.4784 1018.8756 1053.6890 1075.0060 1091.3607 1105.5985 1129.5874 1174.6979 1187.0718 1198.3456 1233.6424 1269.9984 1299.5746 1312.7506 1323.5712 1375.6988 1404.7277 1411.2364 1449.9221 1463.5802 1473.3194 1488.5952 1587.8900 1596.1406 1616.7927 1627.9924 1657.4726 3138.9255 3150.6091 3153.5965 3167.4246 3169.6080 3173.2568 3180.0160 3184.4358 3547.9873
redmass: 16.2210 6.8947 7.1028 5.9764 6.8160 5.7346 7.3982 4.7008 7.3648 6.3482 8.5979 7.1533 6.5354 6.9278 9.6389 6.0831 2.9338 4.0177 2.0227 2.7879 9.8902 4.3151 6.7479 5.4730 5.7408 11.1509 6.4750 7.0622 5.2348 2.2787 8.3050 4.2964 2.1525 2.1738 5.3352 1.4984 1.4103 1.4327 1.4001 7.2175 1.3805 2.2588 2.2327 7.4757 1.3487 4.7273 2.3859 4.7709 2.6567 2.9144 1.9008 2.3856 1.1286 1.1466 1.9030 2.8856 2.8696 1.5480 1.5493 2.0078 3.4151 3.8117 5.7872 2.8892 2.9181 3.5208 3.1105 6.5142 7.1512 6.5807 7.4538 9.2749 1.0866 1.0878 1.0903 1.0921 1.0951 1.0945 1.0982 1.0980 1.0808
irintensity: 0.2575 0.4438 1.4177 0.5395 1.3950 1.2876 0.5556 4.1723 0.5240 4.3007 4.6045 0.6453 12.7703 13.9276 10.1690 7.0830 14.5551 17.3446 78.5880 30.7645 0.2290 4.4880 1.7240 15.2575 2.8484 15.7174 3.5208 7.0547 25.8170 23.2540 17.4419 12.6354 64.8920 22.3858 4.2030 56.2644 1.5743 17.8681 30.9930 89.0063 1.3442 7.8695 33.0421 182.6252 0.5243 118.7259 26.4200 89.0658 8.4487 12.1213 29.8510 31.1462 4.4729 2.1407 16.4345 70.9038 119.9496 9.6793 98.3308 177.7272 17.5836 18.6865 23.6639 6.9813 48.0233 291.3273 225.6949 16.1222 32.1794 220.8377 34.4298 499.8082 3.5537 10.0938 5.6270 1.2708 17.6575 2.6785 4.3296 9.6665 45.9933
temp: 298.150 k
press: 1.00000 atm
elementType: 9 9 9 8 7 7 6 6 6 6 6 6 6 6 6 6 6 6 6 6 1 1 1 1 1 1 1 1 1
symmnumber: 1
zpe: 530479.1 jmol-1
zpe.correction: 0.202049 hartree
zpe.thermalcorrener: 0.218162 hartree
zpe.thermalcorrenthalpy: 0.219106 hartree
zpe.thermalcorrgfe: 0.156032 hartree
zpe.sumelectzpe: -1021.748763 hartree
zpe.sumelectthermal: -1021.732650 hartree
zpe.sumelectthermalent: -1021.731706 hartree
zpe.sumelectthermalfe: -1021.794780 hartree
dipole: 1.1813 -6.1088 -0.9534
dipole: 6.2946
quadrupole: -122.4963 -115.1279 -116.5179
quadrupole: -7.8105 7.5810 1.4577
quadrupole: -4.4489 2.9194 1.5295 -7.8105 7.5810 1.4577
hfenergy: -1021.9508116 hartree
pointgroup: C01 [X(C14H9F3N2O1)]
dipole: -0.0265742 -0.036519 -2.4760881 debye
polarizability: 269.3846467|-44.0573889|96.3071762|-5.8759247|-17.2537219|181.4942494 unknown
InChI: InChI=1S/C14H9F3N2O/c15-14(16,17)9-4-3-5-10(8-9)19-12-7-2-1-6-11(12)13(20)18-19/h1-8,18H
charge 0 multiplicity 1
29 atoms
F  5.145881 0.039973 1.074959
F  3.527475 0.391245 2.630025
F  4.19777 -1.716774 2.143652
O  -3.308228 -0.420551 2.756178
N  -0.861572 -0.391424 0.170354
N  -1.286061 -0.597627 1.517834
C  -1.909749 0.287166 -0.487484
C  -3.013911 0.39796 0.408598
C  0.506616 -0.510454 -0.168124
C  -2.648804 -0.218947 1.699533
C  1.504381 -0.378911 0.832396
C  -1.964894 0.854932 -1.78294
C  -4.211485 1.026551 0.013217
C  0.886901 -0.811025 -1.505705
C  2.861029 -0.539418 0.483049
C  -3.167491 1.488643 -2.160485
C  -4.287848 1.568437 -1.285484
C  2.249347 -0.94494 -1.83465
C  3.250949 -0.815815 -0.847617
C  3.909418 -0.448853 1.557411
H  -0.83982 -1.347576 2.05163
H  1.226932 -0.113108 1.856511
H  -1.116331 0.830264 -2.470383
H  0.121613 -0.97942 -2.267959
H  -5.046325 1.091158 0.718262
H  -3.236352 1.934003 -3.159223
H  4.308231 -0.92675 -1.102959
H  2.532001 -1.175569 -2.86653
H  -5.203068 2.064134 -1.623769
