program: Gaussian 09
title: 000210676
version: EM64L-G09RevD.01
frameworkgroup: C1[X(C16H18N2O3)]
method: RPBEPBE
basis: SDD
operation: Freq
keyword: #p
keyword: freq=noraman
keyword: PBEPBE/SDD
title: #p freq=noraman PBEPBE/SDD
converged: YES YES NO NO
title: Mulliken charges:
elementType: O O O N N C C C C C C C C C C C C C C C C H H H H H H H H H H H H H H H H H H
charge: -0.414103 -0.230550 -0.263552 -0.313641 -0.098399 0.050225 0.262841 -0.480893 -0.507865 -0.421604 -0.420306 0.089187 -0.594183 0.403447 -0.343767 -0.366183 0.196073 -0.363242 -0.341228 0.323868 -0.537591 0.245922 0.211659 0.250514 0.206873 0.211100 0.208342 0.212271 0.208740 0.259525 0.278498 0.239844 0.282095 0.240471 0.252474 0.376275 0.219931 0.220933 0.245996
chargesum: 0.00000
title: Mulliken charges with hydrogens summed into heavy atoms:
elementType: O O O N N C C C C C C C C C C C C C C C C
charge: -0.037828 -0.230550 -0.263552 -0.313641 -0.098399 0.050225 0.262841 -0.023312 -0.050477 -0.002163 0.000704 0.089187 -0.056159 0.403447 -0.103923 -0.084088 0.196073 -0.122771 -0.088754 0.323868 0.149270
polarizability: 3.00091256e+02 3.22612747e+00 1.87530569e+02 -9.02835048e+00 2.09675668e+01 1.23719793e+02
1716.lowfreq: -1.6724 -0.0009 -0.0007 -0.0005 5.5695 5.8230 26.5042 33.9785 38.5569
frequency: 26.4991 33.9479 38.5531 58.4346 68.7494 80.8054 108.5361 127.8092 146.7342 183.3115 188.2161 208.9052 247.4421 266.7254 287.9722 297.1308 314.9777 334.2080 363.7720 406.4903 418.8070 440.2423 452.5393 484.1934 492.8769 515.8375 549.9707 577.6372 602.1298 622.1060 631.0878 645.5817 658.8039 681.8080 717.1347 722.5912 772.4236 801.3365 811.3054 834.7958 837.7871 854.2347 865.5242 912.0514 924.2564 932.2841 959.0271 968.0715 975.7947 988.6244 1001.9885 1035.3976 1054.0010 1080.2313 1081.9350 1093.9451 1112.0676 1118.5781 1138.1552 1151.6562 1155.7413 1176.1714 1179.7311 1194.9175 1227.9098 1244.2111 1245.8480 1250.8244 1269.4576 1306.4226 1323.1457 1329.6192 1337.7335 1343.0767 1346.6449 1378.6374 1383.1391 1422.9524 1428.1186 1435.8776 1451.5124 1458.0947 1465.2839 1467.1386 1469.5049 1473.9677 1474.9780 1497.7974 1509.3906 1571.8955 1591.1192 1628.5301 1671.7293 2955.3566 2956.4823 2957.4684 2983.0494 2984.0199 2986.2394 3020.9973 3033.3960 3044.4465 3044.7123 3052.9025 3067.7700 3125.1781 3154.4675 3161.7951 3180.3976 3187.5333 3512.7157
redmass: 6.2057 7.0138 4.1678 4.2609 5.0794 3.5422 3.6266 3.1731 3.5247 4.2554 2.6637 3.8315 1.2148 5.7019 2.8481 2.3988 3.5264 3.2734 5.5053 4.3962 3.2416 4.8148 2.9760 2.1282 2.8537 2.8731 3.7408 4.7285 3.0361 5.3681 2.8359 2.1856 4.6614 4.4059 4.5525 3.8951 5.8516 1.3436 3.0812 1.5602 1.5612 2.5757 4.1708 1.5118 1.3723 2.4640 3.0904 1.3733 2.5959 8.0011 2.5339 3.3297 3.1776 1.9048 3.4374 2.0885 1.2599 1.3609 1.1894 1.5870 1.3235 1.4999 1.2548 1.8940 2.9908 1.3215 1.5157 1.4966 1.6184 1.3762 1.8650 1.3760 2.1276 1.4877 1.6388 3.7132 6.8437 1.9116 1.6132 1.2148 3.1854 1.1220 1.1144 1.0507 1.1341 1.0930 1.1131 7.6343 3.0806 6.6966 7.6274 6.4857 8.2642 1.0640 1.0670 1.0335 1.0631 1.0619 1.0662 1.0944 1.0923 1.1038 1.0993 1.1043 1.0921 1.0992 1.0881 1.0893 1.0945 1.0962 1.0640
irintensity: 0.8017 0.6427 1.2143 1.4807 1.2486 0.7653 2.3882 4.1129 2.6362 0.4128 4.0894 5.0424 0.5488 0.9072 1.9628 0.0554 2.9938 0.7388 1.9110 3.2781 0.1265 4.0098 5.7952 11.9092 5.7302 14.7341 54.0395 21.4065 18.1807 10.6780 34.5737 103.0557 4.4032 5.1144 8.6204 0.1730 14.2604 17.8689 23.5191 2.8663 64.0460 9.3227 3.7627 1.3138 0.2421 3.3867 3.6413 0.7095 9.6026 47.8022 20.5318 331.4444 76.9744 0.1366 1.9862 10.2444 0.1675 9.0132 1.2814 0.4042 2.8020 18.5132 81.1252 0.5356 206.9904 6.3982 3.9572 4.4109 0.0989 3.4568 0.4530 1.4870 90.6862 0.3537 11.3932 17.8029 32.5943 20.0383 22.4589 22.5555 1.7229 6.5799 12.6188 13.7512 9.9118 49.4900 20.9859 11.8598 366.1183 2.3141 14.0853 7.4076 187.9896 31.0122 48.6320 70.9948 36.2400 31.4319 17.4133 23.5426 17.8837 47.9991 69.0708 59.7000 2.1198 27.9528 14.1734 6.0712 8.3144 0.4322 25.2004
temp: 298.150 k
press: 1.00000 atm
elementType: 8 8 8 7 7 6 6 6 6 6 6 6 6 6 6 6 6 6 6 6 6 1 1 1 1 1 1 1 1 1 1 1 1 1 1 1 1 1 1
symmnumber: 1
zpe: 822002.5 jmol-1
zpe.correction: 0.313084 hartree
zpe.thermalcorrener: 0.332217 hartree
zpe.thermalcorrenthalpy: 0.333161 hartree
zpe.thermalcorrgfe: 0.263976 hartree
zpe.sumelectzpe: -954.132297 hartree
zpe.sumelectthermal: -954.113164 hartree
zpe.sumelectthermalent: -954.112220 hartree
zpe.sumelectthermalfe: -954.181406 hartree
dipole: -1.0328 3.0074 -0.0034
dipole: 3.1798
quadrupole: -98.3073 -116.9747 -124.6367
quadrupole: -10.0029 -9.6073 1.2998
quadrupole: 14.9989 -3.6685 -11.3305 -10.0029 -9.6073 1.2998
hfenergy: -954.4453813 hartree
pointgroup: C01 [X(C16H18N2O3)]
dipole: 0.4178319 -1.1762454 0.0835819 debye
polarizability: 299.8651129|5.2037289|184.4159792|10.253454|-25.0503333|127.0605256 unknown
InChI: InChI=1S/C16H18N2O3/c1-21-12-8-6-11(7-9-12)18-15-5-3-2-4-13(15)14(17-18)10-16(19)20/h6-9,19H,2-5,10H2,1H3
charge 0 multiplicity 1
39 atoms
O  -5.058933 2.751947 0.082023
O  -4.280834 1.010064 1.401563
O  5.625852 0.962215 -0.04289
N  0.045606 -0.005706 -0.177645
N  -0.766874 1.103319 -0.456131
C  -2.053576 -0.809036 -0.240927
C  -0.712115 -1.175469 -0.051426
C  -0.224021 -2.583444 0.172453
C  -3.198227 -1.7928 -0.185137
C  -1.353657 -3.577293 -0.214008
C  -2.715015 -3.151323 0.389966
C  -2.036605 0.601262 -0.487002
C  -3.174132 1.540583 -0.77433
C  1.46219 0.192957 -0.112335
C  2.293851 -0.641895 0.6677
C  2.037968 1.275475 -0.830106
C  -4.177277 1.692986 0.3616
C  3.689861 -0.42576 0.712639
C  3.4213 1.500276 -0.779357
C  4.258059 0.647557 -0.014225
C  6.52816 0.117045 0.741185
H  0.689742 -2.789829 -0.417483
H  0.041829 -2.743114 1.238375
H  -4.016076 -1.388294 0.439647
H  -3.618309 -1.949673 -1.201054
H  -1.441145 -3.624055 -1.317635
H  -1.080521 -4.590977 0.135331
H  -2.609733 -3.066018 1.490008
H  -3.475818 -3.930868 0.19693
H  -3.750721 1.21585 -1.664312
H  -2.774415 2.540883 -1.016555
H  1.864797 -1.446538 1.269656
H  1.381999 1.930599 -1.407823
H  4.309184 -1.085951 1.326764
H  3.878856 2.329652 -1.326825
H  -5.71693 2.8302 0.825372
H  6.501331 -0.933993 0.392106
H  6.281083 0.155539 1.820293
H  7.531469 0.536325 0.576198
