program: Gaussian 09
title: 000210675
version: EM64L-G09RevD.01
frameworkgroup: C1[X(C15H16N2O3)]
method: RPBEPBE
basis: SDD
operation: Freq
keyword: #p
keyword: freq=noraman
keyword: PBEPBE/SDD
title: #p freq=noraman PBEPBE/SDD
converged: YES YES NO NO
title: Mulliken charges:
elementType: O O O N N C C C C C C C C C C C C C C C H H H H H H H H H H H H H H H H
charge: -0.414759 -0.263696 -0.231104 -0.275304 -0.117799 0.014561 0.229845 -0.495491 -0.512460 -0.454152 0.121464 -0.589796 0.407519 -0.358053 -0.378148 0.198521 -0.360005 -0.338643 0.324944 -0.537502 0.226209 0.239529 0.257148 0.216499 0.233362 0.219485 0.265182 0.279838 0.246500 0.291828 0.239469 0.252475 0.376582 0.219904 0.220080 0.245970
chargesum: 0.00000
title: Mulliken charges with hydrogens summed into heavy atoms:
elementType: O O O N N C C C C C C C C C C C C C C C
charge: -0.038177 -0.263696 -0.231104 -0.275304 -0.117799 0.014561 0.229845 -0.029753 -0.038813 -0.001305 0.121464 -0.044777 0.407519 -0.111553 -0.086320 0.198521 -0.120536 -0.086169 0.324944 0.148453
polarizability: 2.94598122e+02 3.33623946e+00 1.85639215e+02 -6.62668309e+00 4.21037306e+00 1.01834117e+02
1716.lowfreq: -6.7916 -1.1164 -0.0005 -0.0005 0.0008 6.5171 23.6497 30.3638 36.3505
frequency: 23.0263 30.3163 36.1181 51.9123 79.4860 96.3785 106.9733 141.5121 157.1690 184.9504 191.1481 223.7592 236.2673 254.3114 275.8548 311.9821 331.4783 378.0625 399.1589 415.3434 467.3407 487.9329 522.4292 546.6602 561.9129 585.1648 604.6543 626.9819 633.3204 646.6587 649.5777 699.0462 724.7122 732.0112 771.8935 797.4254 830.3208 843.0611 844.7656 876.6842 897.5818 901.8310 922.3131 940.6389 977.6556 988.1500 995.7940 1006.5698 1035.8281 1043.1426 1047.3288 1062.7539 1110.8911 1118.0229 1139.7715 1155.3928 1168.7833 1179.3476 1185.1650 1196.8565 1205.1549 1227.1590 1244.8646 1255.6019 1282.3231 1296.7268 1305.6199 1318.4341 1333.7160 1381.2741 1386.2355 1423.4608 1429.4931 1435.4633 1460.3718 1463.0624 1466.1474 1470.1788 1474.5077 1482.6161 1512.6679 1520.1646 1553.0944 1591.2978 1629.2973 1671.6870 2956.1943 2967.2804 2976.5870 2982.1013 3011.6707 3035.0412 3042.6907 3059.9522 3067.9098 3081.6247 3124.7128 3154.5635 3162.6252 3178.6918 3190.2808 3513.8251
redmass: 3.9830 4.9785 8.4579 5.1454 4.6944 3.7956 3.8235 2.1643 3.0889 2.6903 3.4597 4.2753 1.3103 2.9740 5.4993 4.0931 5.1651 5.6468 5.2354 3.0412 3.9411 2.0206 2.5076 4.7287 3.8131 5.0955 4.0038 5.1540 2.2139 4.6986 2.7667 2.6185 3.7690 3.8437 6.0852 1.3665 2.4867 1.5279 4.7201 4.1500 2.4022 1.6648 1.3845 2.5048 1.3373 8.6081 3.2792 2.6683 3.0879 2.0466 2.2779 5.1556 1.2610 1.3131 1.1866 1.3321 1.7511 1.2370 1.4362 1.4020 1.3643 2.9762 1.5879 1.7299 1.3471 2.0313 1.3566 1.8240 2.3956 4.7998 4.9222 2.9417 1.2226 1.2082 1.7928 1.4564 1.0570 1.1080 1.1410 1.1737 3.2824 10.0976 6.4511 7.8622 6.4689 8.3126 1.0332 1.0642 1.0677 1.0670 1.0649 1.0940 1.1038 1.0945 1.0911 1.1047 1.0990 1.0878 1.0897 1.0946 1.0958 1.0640
irintensity: 1.0438 0.4684 0.3831 2.1625 0.5295 1.2838 4.5212 1.7672 2.7917 7.3144 1.2223 2.8286 1.2642 0.2354 1.8225 3.1769 0.7525 2.7450 1.2535 0.1994 1.9979 22.0465 14.2445 18.2087 21.7428 42.4107 36.5307 16.5733 33.8831 28.5533 61.1302 6.6752 1.2372 12.9892 8.4334 25.5176 5.4652 62.6601 8.1121 12.4777 6.2649 2.4663 0.1372 4.9142 0.5572 62.1788 22.7931 3.0560 165.9034 173.6321 28.9377 25.7178 0.1759 11.1200 0.8195 3.4971 25.4583 65.2438 11.4381 3.6188 6.1245 196.4091 1.7764 6.4713 6.2210 4.7054 6.3020 33.5071 74.2944 6.8697 23.0170 13.0778 32.9124 23.2204 8.6444 1.5886 13.9981 15.4566 52.1021 4.6422 420.5695 21.2338 4.0945 7.6438 4.8733 191.8847 77.3329 37.1115 51.4012 19.2294 42.7661 23.6368 51.4267 17.7230 2.3719 45.6930 27.8480 14.7513 6.1747 7.4604 0.8770 25.5735
temp: 298.150 k
press: 1.00000 atm
elementType: 8 8 8 7 7 6 6 6 6 6 6 6 6 6 6 6 6 6 6 6 1 1 1 1 1 1 1 1 1 1 1 1 1 1 1 1
symmnumber: 1
zpe: 746337.9 jmol-1
zpe.correction: 0.284265 hartree
zpe.thermalcorrener: 0.302472 hartree
zpe.thermalcorrenthalpy: 0.303416 hartree
zpe.thermalcorrgfe: 0.235797 hartree
zpe.sumelectzpe: -914.894916 hartree
zpe.sumelectthermal: -914.876709 hartree
zpe.sumelectthermalent: -914.875765 hartree
zpe.sumelectthermalfe: -914.943384 hartree
dipole: -1.1875 3.0134 -0.6663
dipole: 3.3068
quadrupole: -90.9130 -109.1361 -120.4699
quadrupole: -12.1861 -2.7121 -2.7019
quadrupole: 15.9267 -2.2964 -13.6302 -12.1861 -2.7121 -2.7019
hfenergy: -915.1791812 hartree
pointgroup: C01 [X(C15H16N2O3)]
dipole: 0.4782478 1.1959566 0.1830733 debye
polarizability: 294.685948|-4.9892667|184.6286166|-1.6517986|-10.5817186|102.7568895 unknown
InChI: InChI=1S/C15H16N2O3/c1-20-11-7-5-10(6-8-11)17-14-4-2-3-12(14)13(16-17)9-15(18)19/h5-8,18H,2-4,9H2,1H3
charge 0 multiplicity 1
36 atoms
O  -5.384833 -2.226644 -0.078139
O  5.501454 -1.066708 0.000225
O  -4.59304 -0.376598 -1.232591
N  -0.028875 0.130239 0.216959
N  -0.91103 -0.938806 0.46824
C  -2.091491 1.02116 0.196341
C  -0.735715 1.311382 0.042236
C  -0.460134 2.764921 -0.252556
C  -2.938556 2.26196 0.032571
C  -1.910953 3.278658 -0.594841
C  -2.164606 -0.379348 0.459898
C  -3.343236 -1.270511 0.735806
C  1.376703 -0.128207 0.164469
C  2.312177 0.930839 0.145509
C  1.838436 -1.470549 0.140295
C  -4.450409 -1.200687 -0.305443
C  3.69811 0.662323 0.087278
C  3.213914 -1.739869 0.087909
C  4.153336 -0.67753 0.057072
C  6.508465 -0.005021 -0.038412
H  -0.04462 3.290188 0.631638
H  0.237163 2.93102 -1.093978
H  -3.808949 2.09993 -0.625553
H  -3.32026 2.627455 1.007026
H  -2.03501 3.274593 -1.692782
H  -2.073387 4.312698 -0.24339
H  -3.812821 -1.024157 1.710334
H  -3.00526 -2.318067 0.820476
H  1.977812 1.970394 0.188984
H  1.104147 -2.278293 0.166812
H  4.400559 1.500705 0.07423
H  3.585919 -2.768534 0.067592
H  -6.113032 -2.157047 -0.753853
H  6.470683 0.62106 0.874776
H  6.384239 0.636625 -0.932943
H  7.475299 -0.526875 -0.088895
