program: Gaussian 09
title: 000210674
version: EM64L-G09RevD.01
frameworkgroup: C1[X(C15H15ClN2O2)]
method: RPBEPBE
basis: SDD
operation: Freq
keyword: #p
keyword: freq=noraman
keyword: PBEPBE/SDD
title: #p freq=noraman PBEPBE/SDD
converged: YES YES NO NO
title: Mulliken charges:
elementType: Cl O O N N C C C C C C C C C C C C C C C H H H H H H H H H H H H H H H
charge: -0.059003 -0.412889 -0.229487 -0.311218 -0.096340 0.051935 0.267335 -0.507560 -0.485029 -0.421009 -0.423389 0.093218 -0.593663 0.407054 -0.323886 -0.369878 0.197021 -0.216591 -0.192377 -0.117921 0.252359 0.209227 0.247379 0.215451 0.213859 0.211317 0.212281 0.211713 0.261173 0.279253 0.250926 0.289060 0.254687 0.256883 0.378110
chargesum: 0.00000
title: Mulliken charges with hydrogens summed into heavy atoms:
elementType: Cl O O N N C C C C C C C C C C C C C C C
charge: -0.059003 -0.034779 -0.229487 -0.311218 -0.096340 0.051935 0.267335 -0.045974 -0.022199 0.004168 0.000605 0.093218 -0.053237 0.407054 -0.072961 -0.080818 0.197021 0.038096 0.064506 -0.117921
polarizability: 2.93611191e+02 5.74965075e+00 1.81534527e+02 -7.99617484e+00 2.13409445e+01 1.13367439e+02
1716.lowfreq: -6.4581 -0.0009 -0.0006 0.0010 3.0556 9.3297 27.3414 36.3736 41.6058
frequency: 27.3021 36.3227 41.6043 61.6375 71.9453 85.8438 128.4510 135.6884 175.5067 186.6697 230.6886 252.9810 288.0367 297.6838 311.5320 336.5139 348.5961 395.3452 413.3924 439.6514 457.1711 486.4723 494.0246 508.1597 549.8018 595.2696 620.3314 625.3918 642.7144 655.7448 680.9530 693.1241 704.4135 737.9501 809.3550 812.5023 833.2398 835.7950 854.0204 866.3309 912.5560 932.1997 940.4742 959.5566 966.6011 976.8348 996.0386 1034.5315 1052.3956 1073.7716 1079.3661 1081.2425 1093.5514 1117.9057 1138.9824 1151.3201 1176.3077 1182.5093 1193.9463 1244.2676 1246.3927 1250.1955 1269.4307 1297.1928 1322.0591 1329.1150 1339.0444 1344.0512 1346.9918 1373.1815 1379.3029 1404.3775 1425.6905 1446.2134 1457.7719 1464.3368 1470.2874 1475.1446 1489.0529 1496.9234 1573.7426 1592.5852 1605.0453 1671.0674 2956.1221 2958.6010 2984.9235 2985.9646 2988.7589 3022.8417 3034.7379 3047.3887 3055.2443 3070.6439 3164.8973 3165.7021 3189.4856 3192.3820 3513.6922
redmass: 7.0926 10.3924 4.1341 6.0114 5.1687 4.3442 3.5905 3.7448 5.5166 2.8835 7.6639 7.3564 3.0671 2.2474 4.3603 3.5747 5.1459 4.7297 3.0154 4.5217 3.3201 2.0489 3.7225 3.1606 4.2701 3.0998 6.0133 3.7726 1.7510 4.4780 4.4182 5.3431 3.7732 5.8610 2.8806 1.3677 1.4659 1.5340 2.6206 4.1664 1.5107 2.4681 1.3551 2.9044 1.4215 2.5006 3.7466 3.4037 3.2149 3.3529 2.9128 1.9211 1.9818 1.3990 1.1874 1.6111 1.5029 1.1334 1.8570 1.2982 1.5043 1.5352 1.5426 1.3583 1.8760 1.3905 2.1546 1.4815 1.6212 4.2220 5.4484 3.5810 1.1482 3.3579 1.1275 1.1046 1.1345 1.0997 3.5606 6.9175 6.9097 7.8475 6.3932 8.2932 1.0640 1.0671 1.0646 1.0608 1.0661 1.0946 1.0927 1.0992 1.1044 1.0924 1.0899 1.0901 1.0948 1.0959 1.0640
irintensity: 0.1993 0.9957 0.2450 0.4936 1.8648 0.1444 4.3221 0.2502 0.1917 2.0250 2.0167 0.3322 3.4962 0.4583 0.5618 0.1927 3.4521 5.3899 0.1805 1.5097 27.1135 16.0199 24.0599 7.1950 44.5611 22.2938 4.7459 24.7482 113.8359 3.8223 7.4883 5.9897 1.7727 16.9007 17.9281 24.7238 55.0485 3.6640 9.0395 2.6951 0.8911 4.0708 1.8539 6.6879 2.6536 8.6075 26.9171 341.0336 90.6428 30.1304 2.6080 0.7710 6.4218 5.8378 0.9709 0.2081 20.3075 0.3194 3.2337 5.4551 7.9001 3.9834 1.7249 1.6924 1.1129 2.5471 103.3965 0.5491 19.5689 27.6799 44.7220 5.5772 40.5293 6.8886 5.1862 13.0784 11.6821 5.3074 179.2927 164.8678 5.8119 6.0746 21.1944 189.5953 32.6268 37.4151 36.3050 28.7222 15.1676 22.8875 15.4684 63.8013 56.1746 1.9490 2.1659 3.5085 3.2366 1.4848 27.6051
temp: 298.150 k
press: 1.00000 atm
elementType: 17 8 8 7 7 6 6 6 6 6 6 6 6 6 6 6 6 6 6 6 1 1 1 1 1 1 1 1 1 1 1 1 1 1 1
symmnumber: 1
zpe: 714368.6 jmol-1
zpe.correction: 0.272089 hartree
zpe.thermalcorrener: 0.289807 hartree
zpe.thermalcorrenthalpy: 0.290751 hartree
zpe.thermalcorrgfe: 0.224379 hartree
zpe.sumelectzpe: -1299.171055 hartree
zpe.sumelectthermal: -1299.153337 hartree
zpe.sumelectthermalent: -1299.152393 hartree
zpe.sumelectthermalfe: -1299.218765 hartree
dipole: 2.5526 2.1285 -1.0180
dipole: 3.4760
quadrupole: -125.8924 -112.7459 -125.0606
quadrupole: -4.7332 -3.0035 2.3600
quadrupole: -4.6594 8.4871 -3.8276 -4.7332 -3.0035 2.3600
hfenergy: -1299.4431438 hartree
pointgroup: C01 [X(C15H15Cl1N2O2)]
dipole: -0.9598883 -0.9137744 -0.3374037 debye
polarizability: 292.713954|12.0687053|179.0764367|8.473214|-25.5971407|116.7227651 unknown
InChI: InChI=1S/C15H15ClN2O2/c16-10-5-7-11(8-6-10)18-14-4-2-1-3-12(14)13(17-18)9-15(19)20/h5-8,19H,1-4,9H2
charge 0 multiplicity 1
35 atoms
Cl 6.360583 0.970984 0.150289
O  -4.713909 2.775973 0.003851
O  -3.946223 1.048923 1.350462
N  0.382018 0.007561 -0.164106
N  -0.425864 1.114848 -0.470832
C  -1.716494 -0.794391 -0.250769
C  -0.38067 -1.162083 -0.036291
C  -2.866868 -1.771364 -0.197529
C  0.097803 -2.569954 0.210529
C  -2.399179 -3.123426 0.404396
C  -1.032231 -3.56382 -0.17511
C  -1.69352 0.614343 -0.513922
C  -2.827738 1.549534 -0.825684
C  1.793048 0.212009 -0.076518
C  2.622537 -0.654694 0.678901
C  2.364619 1.327477 -0.741949
C  -3.837914 1.718666 0.302453
C  4.014363 -0.427924 0.743935
C  3.751628 1.562158 -0.67142
C  4.562185 0.675484 0.065132
H  -3.690682 -1.352305 0.409334
H  -3.272663 -1.940171 -1.21715
H  1.014743 -2.79089 -0.368906
H  0.351759 -2.71637 1.281173
H  -2.309483 -3.022886 1.504394
H  -3.160925 -3.90171 0.211378
H  -1.105295 -3.62728 -1.278846
H  -0.767439 -4.572693 0.19318
H  -3.398112 1.208245 -1.713236
H  -2.427397 2.545838 -1.081943
H  2.197903 -1.486947 1.243566
H  1.709512 2.00161 -1.297735
H  4.65504 -1.093789 1.328871
H  4.19383 2.420098 -1.185715
H  -5.377067 2.867246 0.741118
