program: Gaussian 09
title: 000210673
version: EM64L-G09RevD.01
frameworkgroup: C1[X(C14H13ClN2O2)]
method: RPBEPBE
basis: SDD
operation: Freq
keyword: #p
keyword: freq=noraman
keyword: PBEPBE/SDD
title: #p freq=noraman PBEPBE/SDD
converged: YES YES NO NO
title: Mulliken charges:
elementType: Cl O O N N C C C C C C C C C C C C C C H H H H H H H H H H H H H
charge: -0.059938 -0.413179 -0.230332 -0.276626 -0.115441 0.017066 0.232808 -0.512582 -0.497330 -0.454008 0.125838 -0.589355 0.416720 -0.336460 -0.381785 0.199496 -0.216450 -0.188537 -0.116309 0.259423 0.219099 0.230787 0.240473 0.235253 0.222385 0.267018 0.280652 0.255315 0.297010 0.253681 0.256862 0.378448
chargesum: 0.00000
title: Mulliken charges with hydrogens summed into heavy atoms:
elementType: Cl O O N N C C C C C C C C C C C C C C
charge: -0.059938 -0.034731 -0.230332 -0.276626 -0.115441 0.017066 0.232808 -0.034060 -0.026070 0.003630 0.125838 -0.041685 0.416720 -0.081144 -0.084776 0.199496 0.037231 0.068325 -0.116309
polarizability: 2.86012105e+02 6.33924454e+00 1.79060601e+02 -6.89237191e+00 5.32206725e+00 9.26501987e+01
1716.lowfreq: -5.8506 -0.0014 0.0013 0.0015 2.7221 9.9071 27.8960 33.7752 36.0502
frequency: 27.8886 33.6998 35.9765 54.9010 80.9456 100.4751 138.0455 139.9289 182.2599 195.8104 232.0981 249.7229 266.5310 306.4229 333.2702 367.5469 381.6483 411.7013 478.9688 487.7783 507.9876 548.6904 565.2598 602.8343 622.7009 631.3071 642.3299 648.1448 692.8117 703.3607 708.9776 743.2351 810.4841 829.3018 838.5325 844.8117 877.0807 897.1454 902.3848 940.5496 941.8812 974.2673 992.4114 1007.0044 1033.6504 1043.7642 1045.5587 1055.9588 1074.2544 1116.5894 1139.7269 1168.9775 1180.1174 1185.9626 1196.6536 1204.4173 1245.8353 1255.0030 1282.2033 1295.5702 1297.4070 1319.3408 1334.9387 1374.3854 1385.4915 1404.9741 1428.7145 1451.7258 1462.2359 1470.1116 1481.4888 1498.9617 1516.4960 1556.4634 1592.0558 1607.0494 1671.0864 2969.6814 2979.2247 2984.5057 3013.9085 3036.7315 3062.0501 3069.5807 3084.0592 3162.8397 3166.2684 3186.4964 3193.1156 3514.1541
redmass: 6.2041 4.5806 8.3598 7.2702 5.3655 4.6326 2.6627 3.0961 2.7139 4.9546 6.1730 3.8836 6.7690 6.3157 4.4694 5.5990 5.2414 2.9738 5.2448 2.2302 2.8807 4.8975 3.6906 3.8845 5.5711 2.8026 3.3488 2.7026 4.3059 3.3536 2.9614 5.2307 1.3733 2.4558 1.4383 4.6494 4.1814 2.4694 1.6306 1.6449 1.8792 1.3411 4.5743 2.8294 3.4746 2.0019 2.3962 5.2085 2.5658 1.3383 1.1857 1.7624 1.1539 1.4011 1.3573 1.3829 1.5779 1.6599 1.3575 1.4939 1.7751 1.7929 2.3925 5.6478 4.5020 3.6763 1.1225 3.3432 1.1263 1.0898 1.1473 3.8472 10.3770 6.5803 8.1558 6.3643 8.3444 1.0639 1.0676 1.0668 1.0652 1.0943 1.0947 1.0914 1.1047 1.0895 1.0905 1.0950 1.0957 1.0640
irintensity: 0.1404 0.1545 0.9740 0.6820 1.0459 2.2948 1.9221 0.5977 4.1011 0.5199 1.8716 1.0114 0.8975 2.3048 0.8645 4.4016 5.1926 0.1051 36.1138 12.7364 14.9124 18.2962 39.3319 38.3390 14.4633 18.9859 44.6187 61.0833 0.8264 7.4552 12.1276 14.0997 23.1065 6.6761 54.3464 7.8395 9.2900 6.8912 1.5740 1.3541 3.5128 1.3569 39.4735 0.8176 149.5133 176.6143 54.3201 39.8341 26.7559 8.0297 0.9153 19.1498 1.6406 5.2719 2.0342 6.6590 8.2233 2.2491 2.7454 4.3257 8.1991 28.1058 102.8039 8.5678 29.0516 6.2363 39.8066 8.3876 2.4432 10.6498 14.8582 355.9824 36.4700 12.3892 1.5933 30.5344 193.3965 33.9570 47.8040 16.2456 40.5822 22.4923 15.7782 2.1451 42.8810 3.1638 3.1031 4.5122 0.4240 28.0395
temp: 298.150 k
press: 1.00000 atm
elementType: 17 8 8 7 7 6 6 6 6 6 6 6 6 6 6 6 6 6 6 1 1 1 1 1 1 1 1 1 1 1 1 1
symmnumber: 1
zpe: 638679.7 jmol-1
zpe.correction: 0.243260 hartree
zpe.thermalcorrener: 0.260058 hartree
zpe.thermalcorrenthalpy: 0.261002 hartree
zpe.thermalcorrgfe: 0.196252 hartree
zpe.sumelectzpe: -1259.933886 hartree
zpe.sumelectthermal: -1259.917089 hartree
zpe.sumelectthermalent: -1259.916145 hartree
zpe.sumelectthermalfe: -1259.980895 hartree
dipole: 2.4791 1.9587 -0.7994
dipole: 3.2591
quadrupole: -119.1458 -104.6298 -120.4659
quadrupole: -5.7830 -2.2194 -2.6430
quadrupole: -4.3986 10.1173 -5.7187 -5.7830 -2.2194 -2.6430
hfenergy: -1260.1771466 hartree
pointgroup: C01 [X(C14H13Cl1N2O2)]
dipole: -0.9342181 0.8454217 0.2379347 debye
polarizability: 285.1080158|-12.6127124|178.8494973|-3.5519528|-11.6757609|93.7653909 unknown
InChI: InChI=1S/C14H13ClN2O2/c15-9-4-6-10(7-5-9)17-13-3-1-2-11(13)12(16-17)8-14(18)19/h4-7,18H,1-3,8H2
charge 0 multiplicity 1
32 atoms
Cl 6.259991 -1.029599 -0.078661
O  -5.03332 -2.244233 -0.047934
O  -4.251154 -0.394932 -1.21108
N  0.317755 0.121981 0.189228
N  -0.560273 -0.950564 0.452264
C  -1.74631 1.007813 0.189921
C  -0.394952 1.302927 0.020336
C  -2.601135 2.244328 0.038115
C  -0.127591 2.758051 -0.275256
C  -1.584856 3.269023 -0.594602
C  -1.812752 -0.393954 0.457872
C  -2.988045 -1.28453 0.74928
C  1.719097 -0.135557 0.125764
C  2.650536 0.930727 0.055069
C  2.180149 -1.47627 0.143862
C  -4.103271 -1.218427 -0.284243
C  4.033772 0.659696 -0.010053
C  3.560832 -1.749006 0.082873
C  4.471893 -0.677258 0.00351
H  -3.476225 2.079138 -0.612708
H  -2.976138 2.602966 1.017456
H  0.300829 3.281466 0.603628
H  0.554788 2.928551 -1.127825
H  -1.723128 3.27451 -1.690659
H  -1.745499 4.299176 -0.231978
H  -3.448373 -1.031172 1.726243
H  -2.650059 -2.33166 0.837025
H  2.315686 1.97029 0.062524
H  1.448139 -2.283636 0.208505
H  4.755474 1.479768 -0.063647
H  3.920317 -2.78181 0.095034
H  -5.76768 -2.179004 -0.717364
