program: Gaussian 09
title: 000210672
version: EM64L-G09RevD.01
frameworkgroup: C1[X(C15H16N2O2)]
method: RPBEPBE
basis: SDD
operation: Freq
keyword: #p
keyword: freq=noraman
keyword: PBEPBE/SDD
title: #p freq=noraman PBEPBE/SDD
converged: YES YES NO NO
title: Mulliken charges:
elementType: O O N N C C C C C C C C C C C C C C C H H H H H H H H H H H H H H H H
charge: -0.413719 -0.230185 -0.312238 -0.096551 0.050585 0.265009 -0.507869 -0.482951 -0.420786 -0.422264 0.091115 -0.593819 0.395713 -0.336965 -0.382309 0.196806 -0.232300 -0.207775 -0.249202 0.207507 0.251914 0.214246 0.247469 0.209546 0.212873 0.209706 0.211087 0.278747 0.260018 0.243865 0.281534 0.225974 0.228534 0.229779 0.376907
chargesum: 0.00000
title: Mulliken charges with hydrogens summed into heavy atoms:
elementType: O O N N C C C C C C C C C C C C C C C
charge: -0.036813 -0.230185 -0.312238 -0.096551 0.050585 0.265009 -0.048448 -0.021235 0.001632 -0.001471 0.091115 -0.055054 0.395713 -0.093100 -0.100775 0.196806 -0.006326 0.020759 -0.019423
polarizability: 2.52510682e+02 -9.83446027e+00 1.80242716e+02 1.10926695e+01 2.04313492e+01 1.11744085e+02
1716.lowfreq: -8.3056 -3.9687 -0.0005 0.0004 0.0005 2.7713 27.4760 37.4174 41.3733
frequency: 27.4269 37.3855 41.3290 69.2493 77.0759 109.6464 128.2577 161.4184 191.5685 237.8195 281.6258 287.1854 295.5461 317.0325 355.8328 390.8669 408.9181 444.8164 474.3511 486.0315 504.6868 550.1051 594.9642 612.7414 623.2361 643.4855 651.2575 666.4043 680.9606 695.4008 730.9341 764.8079 808.7010 833.6581 840.2565 854.2007 865.5842 911.3711 911.7264 932.1616 959.3767 970.8424 975.7247 988.0931 991.4203 1024.9206 1034.6296 1051.7645 1073.8642 1079.7069 1084.7832 1106.1068 1137.4350 1150.7992 1171.5748 1175.0840 1186.0845 1194.0844 1243.3128 1245.4572 1249.6428 1270.4625 1320.3333 1324.8750 1330.6761 1337.6812 1343.4081 1345.5207 1375.8391 1386.5524 1423.9377 1438.6547 1452.0253 1457.8408 1464.7354 1469.1856 1474.5965 1492.4179 1498.4345 1574.7337 1597.9804 1613.5183 1671.5330 2957.0885 2958.5822 2983.7783 2984.3432 2985.5493 3022.3800 3034.7180 3045.4144 3053.5772 3068.6517 3130.0351 3140.8842 3161.1422 3181.9295 3186.3249 3512.2135
redmass: 6.7647 8.1934 3.7779 4.8717 3.4948 4.0253 3.2175 3.6107 2.8972 4.0569 3.2815 4.7134 3.4671 2.4011 3.8601 4.9978 2.9276 3.7961 2.7094 2.1100 3.3139 4.1946 3.3110 6.2675 3.8953 1.5794 4.4221 5.0243 4.4045 1.9962 5.1859 1.7312 3.0551 1.4928 1.2999 2.5464 4.1710 1.4740 1.4654 2.5100 3.0782 1.3962 2.5187 5.4746 1.3391 2.2592 3.5352 2.9204 2.3287 1.9148 2.1969 1.9415 1.1872 1.6003 1.0540 1.4804 1.1504 1.8309 1.3008 1.4964 1.5021 1.6580 1.7334 1.4966 1.3484 2.1714 1.4708 1.6395 3.4930 9.2937 1.1553 2.7685 2.7624 1.1236 1.1045 1.1300 1.1026 3.8063 5.3720 6.5105 6.8553 6.1652 8.2774 1.0675 1.0636 1.0648 1.0603 1.0662 1.0950 1.0923 1.0994 1.1043 1.0921 1.0852 1.0905 1.0965 1.0938 1.0965 1.0640
irintensity: 0.5655 0.8711 0.4192 2.4859 0.3920 0.3412 3.7570 0.7071 1.7580 0.5266 1.8465 2.3148 0.8577 1.5022 0.7430 1.6146 0.4908 10.5377 3.2720 12.6148 6.3805 45.6776 18.9907 0.2393 24.9479 97.0689 13.3118 21.2985 5.2261 40.8774 11.5403 68.1191 25.1313 1.4256 2.2604 10.4002 3.1025 3.4424 2.7301 2.5415 5.6187 1.2926 2.0801 0.2173 0.4936 5.9239 294.4103 118.4160 3.9382 0.1190 3.4951 6.4072 0.6774 0.2085 0.2964 19.4999 1.0004 2.7320 5.8607 5.9925 4.0743 1.8498 6.5511 0.3529 1.3523 98.1276 1.8910 17.7617 66.5513 5.4944 45.3871 1.7891 3.6733 6.2600 8.1243 10.1683 4.5565 58.0966 133.4859 7.0734 7.6423 75.6605 189.1112 41.6398 28.8533 37.4621 29.9316 15.3983 22.3960 16.3332 64.4058 58.7751 2.0674 0.7298 17.7038 37.0063 9.5401 1.7307 25.7607
temp: 298.150 k
press: 1.00000 atm
elementType: 8 8 7 7 6 6 6 6 6 6 6 6 6 6 6 6 6 6 6 1 1 1 1 1 1 1 1 1 1 1 1 1 1 1 1
symmnumber: 1
zpe: 739688.7 jmol-1
zpe.correction: 0.281733 hartree
zpe.thermalcorrener: 0.298160 hartree
zpe.thermalcorrenthalpy: 0.299104 hartree
zpe.thermalcorrgfe: 0.235998 hartree
zpe.sumelectzpe: -839.781271 hartree
zpe.sumelectthermal: -839.764844 hartree
zpe.sumelectthermalent: -839.763900 hartree
zpe.sumelectthermalfe: -839.827005 hartree
dipole: 0.1781 1.8266 -0.9172
dipole: 2.0517
quadrupole: -94.5939 -103.6545 -113.6030
quadrupole: 3.0134 3.7011 1.6432
quadrupole: 9.3566 0.2960 -9.6525 3.0134 3.7011 1.6432
hfenergy: -840.0630034 hartree
pointgroup: C01 [X(C15H16N2O2)]
dipole: -0.0791896 -0.7433807 -0.304459 debye
polarizability: 252.2668523|-11.6035291|176.9829341|-10.2863592|-25.3551978|115.2476969 unknown
InChI: InChI=1S/C15H16N2O2/c18-15(19)10-13-12-8-4-5-9-14(12)17(16-13)11-6-2-1-3-7-11/h1-3,6-7,18H,4-5,8-10H2
charge 0 multiplicity 1
35 atoms
O  4.598496 2.486608 -0.019583
O  3.741076 0.796908 1.318933
N  -0.695772 0.109157 -0.126934
N  0.189386 1.154087 -0.435342
C  1.335063 -0.848575 -0.248058
C  -0.022566 -1.115134 -0.01759
C  2.40816 -1.91072 -0.221627
C  -0.60329 -2.485373 0.222098
C  1.846201 -3.231641 0.368924
C  0.440909 -3.557118 -0.19538
C  1.415639 0.559573 -0.499348
C  2.611867 1.410176 -0.823091
C  -2.090356 0.4153 -0.023242
C  -2.96331 -0.380426 0.760457
C  -2.592155 1.554806 -0.702849
C  3.655091 1.48978 0.283998
C  -4.33433 -0.050804 0.835948
C  -3.960672 1.878028 -0.611272
C  -4.842776 1.075202 0.150774
H  2.788577 -2.096208 -1.248221
H  3.268486 -1.563747 0.380152
H  -0.848907 -2.625806 1.295306
H  -1.545481 -2.627353 -0.341229
H  2.542965 -4.063625 0.154739
H  1.779065 -3.140001 1.471365
H  0.104646 -4.548644 0.162209
H  0.493181 -3.608582 -1.301034
H  2.28214 2.436594 -1.060698
H  3.137055 1.038139 -1.726263
H  -2.580691 -1.228094 1.333456
H  -1.897528 2.169122 -1.280329
H  -5.001188 -0.669833 1.446372
H  -4.340174 2.75953 -1.139842
H  -5.906208 1.328827 0.215718
H  5.282705 2.516548 0.703386
