program: Gaussian 09
title: 000210671
version: EM64L-G09RevD.01
frameworkgroup: C1[X(C14H14N2O2)]
method: RPBEPBE
basis: SDD
operation: Freq
keyword: #p
keyword: freq=noraman
keyword: PBEPBE/SDD
title: #p freq=noraman PBEPBE/SDD
converged: YES YES NO NO
title: Mulliken charges:
elementType: O O N N C C C C C C C C C C C C C C H H H H H H H H H H H H H H
charge: -0.414249 -0.230516 -0.277276 -0.115025 0.015038 0.232860 -0.512418 -0.496216 -0.454579 0.123704 -0.589470 0.404867 -0.350363 -0.395324 0.198569 -0.231405 -0.204519 -0.248944 0.257487 0.217407 0.228721 0.240911 0.234022 0.220606 0.265869 0.280293 0.249640 0.290247 0.224832 0.228461 0.229498 0.377274
chargesum: 0.00000
title: Mulliken charges with hydrogens summed into heavy atoms:
elementType: O O N N C C C C C C C C C C C C C C
charge: -0.036976 -0.230516 -0.277276 -0.115025 0.015038 0.232860 -0.037524 -0.026584 0.000049 0.123704 -0.043309 0.404867 -0.100723 -0.105077 0.198569 -0.006573 0.023942 -0.019446
polarizability: 2.46030316e+02 7.89900259e+00 1.77422534e+02 -8.38642921e+00 3.22310632e+00 9.05710647e+01
1716.lowfreq: -3.0182 -0.0004 0.0002 0.0003 2.4122 8.7212 27.6851 33.9240 41.1190
frequency: 27.4836 33.7680 40.9773 71.6304 93.9721 122.7109 140.4536 174.5802 208.1777 226.3542 260.6286 295.8231 311.0569 361.7789 393.7601 407.3231 486.1936 510.5698 548.1997 563.8927 604.2682 613.9427 629.4238 641.2037 644.9160 667.4230 694.4364 701.6333 739.7353 765.8507 829.0256 839.0467 844.7433 876.9741 899.0562 902.7655 915.1875 941.2770 973.5973 987.2236 994.7924 1006.1835 1019.2557 1035.1683 1043.1961 1048.1954 1053.7184 1097.2284 1141.6251 1169.1558 1171.0856 1183.9781 1187.2598 1196.9299 1206.3864 1245.0701 1257.5357 1282.5668 1296.5176 1317.4064 1324.8859 1333.6940 1382.2146 1388.7808 1427.9910 1439.1753 1458.6280 1461.8862 1469.4340 1481.2247 1502.1821 1517.4424 1556.7705 1598.6697 1614.7357 1671.6104 2969.5027 2978.1317 2983.3853 3012.5376 3037.2916 3061.6781 3068.7878 3082.7691 3129.9214 3140.5961 3161.0978 3179.7908 3187.9281 3513.3819
redmass: 5.5972 3.8042 9.5111 5.4261 4.0168 3.6727 2.2207 2.4519 3.3059 4.3480 4.4271 6.5007 4.1414 4.4886 6.0745 2.8958 2.0203 3.0829 4.8394 3.6544 3.8259 5.9352 3.4103 3.9955 2.0646 5.2509 1.9703 2.2740 4.7494 1.7503 2.3360 1.3768 3.9080 4.1145 2.4324 1.6589 1.4397 2.5105 1.3628 6.0600 1.3156 3.0399 2.8702 3.0425 1.9984 2.2457 3.0013 1.7526 1.1850 1.7705 1.0585 1.2198 1.3155 1.3727 1.3438 1.5749 1.7519 1.3425 2.0671 1.5910 1.4774 2.3774 4.1597 7.8460 1.1535 2.5949 2.6081 1.1592 1.0940 1.1439 3.5224 10.2647 6.4269 6.8808 6.1573 8.3186 1.0643 1.0677 1.0669 1.0645 1.0945 1.0945 1.0912 1.1046 1.0852 1.0905 1.0963 1.0944 1.0957 1.0640
irintensity: 0.2232 0.7217 0.5498 3.0757 0.2779 1.6193 2.1282 2.1549 1.5897 1.3566 1.1348 2.2449 1.7639 1.8332 2.0878 0.1177 21.4453 6.2763 19.4580 26.7678 38.2685 4.2944 20.3424 40.6665 63.1683 21.4305 41.1783 6.9074 14.1012 68.2896 4.3259 3.0962 9.9265 13.6688 6.3846 2.6481 6.0670 3.5391 0.5094 0.9440 1.0522 1.5277 27.0208 152.3239 157.4342 42.8060 30.9736 6.7751 1.0119 18.4146 0.4439 2.8271 4.2099 1.9799 6.1863 8.0136 2.2083 2.1944 11.9296 17.5806 6.6507 100.4805 24.0648 10.0530 46.2003 4.2445 6.9293 3.3320 6.6397 5.8385 208.7447 33.1213 12.1835 5.3803 87.8547 192.3837 34.8325 48.7566 17.2568 42.4133 22.0601 16.6176 2.3291 44.5299 0.8886 18.3342 36.7711 8.3429 2.2489 26.2196
temp: 298.150 k
press: 1.00000 atm
elementType: 8 8 7 7 6 6 6 6 6 6 6 6 6 6 6 6 6 6 1 1 1 1 1 1 1 1 1 1 1 1 1 1
symmnumber: 1
zpe: 664408.6 jmol-1
zpe.correction: 0.253060 hartree
zpe.thermalcorrener: 0.268507 hartree
zpe.thermalcorrenthalpy: 0.269451 hartree
zpe.thermalcorrgfe: 0.208296 hartree
zpe.sumelectzpe: -800.544030 hartree
zpe.sumelectthermal: -800.528583 hartree
zpe.sumelectthermalent: -800.527639 hartree
zpe.sumelectthermalfe: -800.588793 hartree
dipole: -0.1522 1.6279 -0.6653
dipole: 1.7652
quadrupole: -88.1858 -95.5564 -108.9692
quadrupole: -3.9414 -2.7965 -3.1075
quadrupole: 9.3847 2.0141 -11.3988 -3.9414 -2.7965 -3.1075
hfenergy: -800.7970898 hartree
pointgroup: C01 [X(C14H14N2O2)]
dipole: 0.0749083 0.6582165 0.2084484 debye
polarizability: 245.7328423|-10.3931437|176.8270559|-4.8015081|-10.4587721|91.4640168 unknown
InChI: InChI=1S/C14H14N2O2/c17-14(18)9-12-11-7-4-8-13(11)16(15-12)10-5-2-1-3-6-10/h1-3,5-6,17H,4,7-9H2
charge 0 multiplicity 1
32 atoms
O  -4.871234 -1.934248 0.000454
O  -3.952726 -0.165279 -1.187261
N  0.656436 0.011485 0.168842
N  -0.295656 -0.994373 0.433628
C  -1.336358 1.048562 0.203157
C  0.031591 1.243214 0.019153
C  -2.098872 2.346044 0.066996
C  0.401597 2.676688 -0.273041
C  -1.016934 3.294707 -0.575291
C  -1.503641 -0.346292 0.459811
C  -2.738342 -1.148982 0.760011
C  2.038034 -0.345407 0.087195
C  3.039455 0.656538 0.034629
C  2.402296 -1.715167 0.069123
C  -3.859778 -0.99254 -0.25668
C  4.398073 0.283847 -0.048772
C  3.763429 -2.072144 -0.009556
C  4.769959 -1.079262 -0.072272
H  -2.991944 2.249943 -0.573344
H  -2.433416 2.727906 1.052349
H  0.875852 3.162955 0.603701
H  1.087567 2.800129 -1.130746
H  -1.166533 3.312412 -1.669821
H  -1.097401 4.333269 -0.209485
H  -3.166277 -0.871239 1.745066
H  -2.47809 -2.219207 0.834878
H  2.771972 1.715302 0.072727
H  1.613305 -2.468459 0.120653
H  5.166715 1.063705 -0.088116
H  4.03875 -3.132575 -0.023755
H  5.825667 -1.363638 -0.135024
H  -5.606695 -1.808593 -0.659108
