program: Gaussian 09
title: 000210667
version: EM64L-G09RevD.01
frameworkgroup: C1[X(C18H20ClN3OS)]
method: RPBEPBE
basis: SDD
operation: Freq
keyword: #p
keyword: freq=noraman
keyword: PBEPBE/SDD
title: #p freq=noraman PBEPBE/SDD
converged: YES YES NO NO
title: Mulliken charges:
elementType: Cl S O N N N C C C C C C C C C C C C C C C C C C H H H H H H H H H H H H H H H H H H H H
charge: -0.055074 -0.070019 -0.239966 -0.282429 -0.134855 -0.034718 0.023801 0.211502 -0.513714 -0.495229 -0.449226 0.148126 -0.570612 -0.209967 -0.361611 -0.392383 0.419638 -0.299850 -0.297010 -0.337578 -0.386234 -0.212910 -0.187535 -0.119061 0.241846 0.241310 0.231271 0.242681 0.231579 0.225240 0.237332 0.274483 0.231185 0.256943 0.273175 0.234549 0.205750 0.226803 0.225786 0.205950 0.256320 0.291603 0.255411 0.257698
chargesum: 0.00000
title: Mulliken charges with hydrogens summed into heavy atoms:
elementType: Cl S O N N N C C C C C C C C C C C C C C C C C C
charge: -0.055074 -0.070019 -0.239966 -0.282429 -0.134855 -0.034718 0.023801 0.211502 -0.030558 -0.021277 0.007592 0.148126 -0.058797 -0.209967 0.126516 0.115341 0.419638 0.132704 0.134725 -0.081258 -0.094631 0.042501 0.070162 -0.119061
polarizability: 3.42697182e+02 -4.94119890e+01 2.35248096e+02 1.20032525e+01 2.10386923e+01 1.71502398e+02
1716.lowfreq: -12.4486 -8.7840 -4.9650 -0.0021 -0.0013 0.0001 6.2968 17.1574 34.1208
frequency: -7.8952 16.6297 34.1132 41.1587 49.4608 53.9297 83.0439 92.8552 125.8514 137.7224 147.7323 169.9887 195.5011 230.7234 248.4417 269.4882 279.1584 288.7396 321.1091 338.2538 363.3291 387.6903 407.6210 409.4831 412.0528 437.5338 475.2383 484.7951 506.2846 517.0698 559.4791 577.1314 606.3236 622.3270 629.4700 645.0576 667.2410 699.8057 704.4258 715.2972 748.0445 797.9933 812.7600 825.6717 832.4979 834.6553 836.6345 849.5779 893.8233 895.7849 901.7533 943.2606 945.4653 970.9120 992.5251 1003.0845 1007.7959 1020.5598 1034.1848 1042.3934 1045.8797 1051.8141 1068.6736 1074.2135 1096.4092 1108.6341 1115.7400 1135.1212 1145.9238 1176.3926 1180.6119 1188.8159 1190.4143 1199.6416 1205.5951 1245.7134 1256.1021 1263.1663 1274.1501 1278.7956 1290.3802 1295.9804 1301.1156 1317.7662 1327.8370 1337.9618 1348.1716 1364.3604 1368.5524 1377.3282 1404.4351 1439.1024 1445.4274 1448.5405 1452.8685 1457.1600 1460.9250 1468.2008 1471.7828 1478.2701 1479.4296 1495.1446 1505.6717 1553.6378 1591.2050 1606.6469 2958.8132 2963.1270 2970.9581 2987.6867 2991.4801 2996.5166 3011.3968 3012.4164 3037.8624 3056.0424 3065.0591 3083.0401 3088.2286 3089.5275 3090.9818 3116.0465 3165.1108 3165.9731 3186.6670 3192.2745
redmass: 6.4192 6.0422 3.8655 3.9314 6.7045 8.8063 5.4216 4.5840 2.4514 4.0940 3.2247 4.3598 3.0619 7.2388 3.8473 5.7118 3.9290 3.4076 4.6256 4.1237 3.5874 4.5950 3.2699 2.2930 2.9862 2.8225 7.2184 3.5484 3.0119 4.3964 3.6308 3.5400 2.9536 6.5286 6.6965 3.7852 3.6042 4.5283 3.6744 2.5931 5.9987 4.4358 1.3794 2.4372 1.7653 2.3772 1.6138 5.6041 1.5643 2.3731 2.5646 1.3444 2.3471 1.3478 4.6230 2.8228 2.5367 2.4315 3.2658 2.1855 2.3331 3.8838 3.3372 2.6066 2.7649 3.0052 1.3423 1.2138 1.8699 1.9239 1.2231 1.2684 1.0765 1.4629 2.2398 1.4931 1.4788 1.4121 1.2319 1.3162 1.6771 1.3058 1.6272 1.8291 1.2645 1.2219 1.3197 3.8007 1.4034 7.1573 3.7380 1.2983 3.8399 1.0859 1.1735 1.1236 1.1216 1.0962 1.1565 1.3020 1.5520 3.5083 7.4505 6.3252 8.1441 6.3857 1.0678 1.0676 1.0638 1.0623 1.0646 1.0648 1.0661 1.0636 1.0948 1.0967 1.1017 1.1046 1.0965 1.0978 1.0987 1.0959 1.0891 1.0903 1.0953 1.0958
irintensity: 0.8830 0.0495 0.2028 1.4747 1.7854 3.9092 1.0957 0.6812 0.4197 0.5216 0.8580 0.9137 9.4536 1.1551 1.1695 2.2531 7.6015 10.1603 7.0114 0.3537 0.4600 0.3394 4.5970 2.4800 0.0702 0.3376 31.7361 1.7827 20.7553 8.9837 12.6955 10.5889 11.9153 5.4116 1.1525 2.2087 4.3232 11.9078 2.1950 3.8749 3.4338 15.1268 20.8575 1.6669 0.8480 8.7616 53.6525 2.5917 0.7690 5.4754 2.0363 0.1319 36.1596 1.7403 41.8055 3.7986 7.3239 25.2230 30.9517 6.6886 25.1010 45.0688 30.0875 32.3524 34.4344 5.4335 9.2763 0.8272 22.0058 7.0991 0.5795 0.1988 2.3114 9.9473 9.7193 48.7141 11.2886 53.9391 28.3283 3.6778 6.1346 1.3453 34.2233 6.5350 6.6073 1.5891 6.2999 48.2256 10.3329 10.0892 7.8943 70.1962 1.3340 2.6063 23.3687 9.4078 6.9812 13.7956 36.9366 45.1805 82.7422 420.9779 12.3027 11.8879 1.0669 27.8561 41.5490 39.4172 32.2261 5.1679 110.3358 25.1660 44.2548 14.6467 22.4349 17.7863 12.6460 41.1578 27.0304 3.0137 33.5886 0.6091 2.8655 3.0529 4.0105 0.1168
temp: 298.150 k
press: 1.00000 atm
elementType: 17 16 8 7 7 7 6 6 6 6 6 6 6 6 6 6 6 6 6 6 6 6 6 6 1 1 1 1 1 1 1 1 1 1 1 1 1 1 1 1 1 1 1 1
symmnumber: 1
zpe: 919688.2 jmol-1
zpe.correction: 0.350291 hartree
zpe.thermalcorrener: 0.371053 hartree
zpe.thermalcorrenthalpy: 0.371998 hartree
zpe.thermalcorrgfe: 0.298485 hartree
zpe.sumelectzpe: -1793.732572 hartree
zpe.sumelectthermal: -1793.711809 hartree
zpe.sumelectthermalent: -1793.710865 hartree
zpe.sumelectthermalfe: -1793.784377 hartree
dipole: 1.2651 0.8078 0.9249
dipole: 1.7631
quadrupole: -182.3040 -150.9929 -151.0935
quadrupole: 13.8770 -0.5173 12.8083
quadrupole: -20.8405 10.4706 10.3700 13.8770 -0.5173 12.8083
hfenergy: -1794.0828625 hartree
pointgroup: C01 [X(C18H20Cl1N3O1S1)]
dipole: -0.5194186 0.2553629 -0.3822968 debye
polarizability: 334.5007822|57.8205294|240.5663861|10.396811|-24.2740704|174.3805076 unknown
InChI: InChI=1S/C18H20ClN3OS/c19-13-4-6-14(7-5-13)22-17-3-1-2-15(17)16(20-22)12-18(24)21-8-10-23-11-9-21/h4-7H,1-3,8-12H2
charge 0 multiplicity 1
44 atoms
Cl -6.583607 -1.898433 -0.002046
S  4.610843 1.314324 0.386788
O  2.800649 -3.273577 -1.432966
N  -1.112838 0.693907 0.20103
N  -0.139231 0.156855 1.074028
N  3.370337 -1.125112 0.428542
C  0.702591 1.999757 -0.024542
C  -0.60923 1.809554 -0.45632
C  1.342406 3.179767 -0.717597
C  -1.061249 2.825535 -1.476052
C  0.096864 3.891108 -1.369057
C  0.962791 0.960719 0.92113
C  2.218881 0.671186 1.712176
C  3.381161 0.187453 0.830553
C  4.443211 -1.703001 -0.420179
C  2.30057 -2.117501 0.720564
C  -2.40166 0.086583 0.142021
C  3.837626 -2.266034 -1.719679
C  1.741046 -2.679842 -0.606127
C  -3.318364 0.4344 -0.88211
C  -2.763216 -0.877802 1.116534
C  -4.593416 -0.16764 -0.925078
C  -4.034327 -1.484053 1.072439
C  -4.936294 -1.119245 0.053294
H  1.891894 3.85019 -0.03456
H  2.072925 2.845974 -1.479012
H  -1.111309 2.386845 -2.493355
H  -2.047702 3.274808 -1.260446
H  -0.238127 4.709311 -0.70615
H  0.334898 4.334682 -2.351196
H  1.985161 -0.057211 2.510575
H  2.568413 1.596852 2.195373
H  4.933977 -2.518329 0.146339
H  5.179611 -0.908469 -0.631943
H  1.475102 -1.662751 1.285469
H  2.743302 -2.943022 1.312645
H  3.405624 -1.439032 -2.322726
H  4.604801 -2.791348 -2.31107
H  1.02631 -3.494695 -0.406825
H  1.227632 -1.867077 -1.163226
H  -3.048309 1.158195 -1.654302
H  -2.044119 -1.135136 1.89669
H  -5.303251 0.096933 -1.713767
H  -4.318974 -2.225331 1.82454
