program: Gaussian 09
title: 000210666
version: EM64L-G09RevD.01
frameworkgroup: C1[X(C19H23N3OS)]
method: RPBEPBE
basis: SDD
operation: Freq
keyword: #p
keyword: freq=noraman
keyword: PBEPBE/SDD
title: #p freq=noraman PBEPBE/SDD
converged: NO YES NO NO
title: Mulliken charges:
elementType: S O N N N C C C C C C C C C C C C C C C C C C C H H H H H H H H H H H H H H H H H H H H H H H
charge: -0.080762 -0.242035 -0.320925 -0.120377 -0.032752 0.054815 0.249126 -0.509361 -0.481625 -0.418076 -0.421965 0.112040 -0.566967 -0.216986 -0.362008 -0.393792 0.398698 -0.300075 -0.298792 -0.339404 -0.386158 -0.229327 -0.207179 -0.248308 0.214726 0.261469 0.213702 0.248992 0.212780 0.207152 0.210525 0.213124 0.236976 0.265884 0.229577 0.256865 0.280053 0.231449 0.207318 0.224811 0.224456 0.211152 0.243863 0.277076 0.228280 0.230069 0.231898
chargesum: 0.00000
title: Mulliken charges with hydrogens summed into heavy atoms:
elementType: S O N N N C C C C C C C C C C C C C C C C C C C
charge: -0.080762 -0.242035 -0.320925 -0.120377 -0.032752 0.054815 0.249126 -0.033165 -0.018931 0.001857 0.001683 0.112040 -0.064107 -0.216986 0.124434 0.117710 0.398698 0.132054 0.136816 -0.095541 -0.109082 -0.001046 0.022890 -0.016410
polarizability: 2.86982386e+02 -4.90905230e+01 2.68969955e+02 1.52745450e+01 1.47711766e+01 1.79164442e+02
1716.lowfreq: -5.5291 0.0004 0.0011 0.0022 5.4008 10.0907 17.4908 29.0759 41.9479
frequency: 15.6028 28.6714 41.9066 56.5123 58.7792 68.4342 86.2352 110.6587 123.1473 145.4948 153.8918 192.8125 237.8106 267.1930 283.0768 293.6973 305.8025 314.0041 319.4010 360.7071 386.8097 402.8596 405.9398 408.8501 438.7349 449.5998 473.4133 485.8043 500.2239 516.1019 566.3514 601.7262 612.7386 624.8786 649.0380 653.0808 669.6631 694.4348 697.3368 751.2170 765.0544 798.5474 804.1654 829.5648 832.5961 834.3144 840.8231 853.0916 905.1661 909.9489 912.7495 933.9831 959.0767 971.5175 975.1688 988.2121 992.1087 1008.9196 1019.9618 1025.1454 1044.3934 1045.1689 1067.2493 1070.8873 1080.2439 1083.5520 1094.1982 1106.5792 1108.9515 1136.7044 1151.1237 1153.5329 1172.3787 1183.8098 1189.3051 1191.2331 1205.4091 1242.9896 1248.4734 1250.8283 1265.1546 1269.7840 1275.4933 1301.2504 1318.6691 1324.6350 1328.8009 1330.4371 1338.6949 1343.1826 1346.0808 1347.9429 1366.8196 1370.7887 1386.5914 1429.3677 1441.0764 1446.2324 1448.1573 1451.5861 1455.0762 1457.2017 1463.2777 1469.4903 1471.5653 1476.1933 1478.8379 1484.1105 1494.2235 1570.8379 1597.3996 1613.6395 2957.3421 2960.9762 2962.9852 2968.1274 2981.7953 2985.7794 2987.7223 2991.9152 3009.9837 3022.7334 3028.2163 3047.3173 3054.1492 3066.2975 3087.9829 3090.7625 3091.8243 3111.3967 3131.9232 3142.2564 3162.0426 3178.6287 3184.4005
redmass: 6.2184 5.6179 3.8825 3.9626 5.8195 5.2229 3.2709 4.2682 3.3137 4.5503 3.4123 3.2494 4.1386 3.6886 3.1247 2.7879 3.0653 2.0953 5.5046 3.0239 4.1429 4.0496 2.4149 2.9545 2.5745 3.4785 2.6838 3.5434 3.6326 3.7481 3.6706 2.4845 6.3586 5.1805 3.7707 4.2285 4.5881 3.3569 2.4524 4.7703 1.7052 4.3783 3.1032 1.9283 1.7733 2.1869 1.2599 2.4277 2.5456 1.4640 1.4219 2.5728 2.8663 1.3871 2.5899 5.8927 1.3143 2.5751 2.5160 2.2385 2.3439 3.7211 2.8602 3.3494 1.9015 2.0085 2.5882 2.1036 2.8052 1.1933 1.5846 1.8866 1.0535 1.3336 1.7753 1.0908 2.2435 1.3112 1.5000 1.3130 1.4150 1.6077 1.2408 1.3352 1.7249 1.4826 1.2614 1.3588 1.2234 1.4671 1.5982 1.3415 1.9413 1.8273 9.2783 4.2144 1.2657 1.0932 2.5011 1.1372 1.1215 1.1426 1.1888 1.1553 1.1741 1.1736 1.8784 3.1308 2.9637 6.2398 6.7904 6.1881 1.0641 1.0665 1.0672 1.0672 1.0646 1.0617 1.0631 1.0626 1.0642 1.0944 1.0942 1.0984 1.1041 1.1020 1.0978 1.0970 1.0988 1.0966 1.0852 1.0903 1.0958 1.0945 1.0970
irintensity: 0.9456 0.0323 0.4558 1.8254 3.7187 2.1492 0.2034 1.3397 0.9489 0.1132 1.0850 6.3793 3.9292 1.6876 14.2607 5.9108 3.4122 1.4133 2.0314 1.4820 2.0615 1.0093 3.4328 1.0226 0.8625 3.8177 4.5070 1.9826 2.4174 11.7513 2.5299 17.6770 0.1263 2.5573 4.2143 14.0537 1.9266 17.3824 24.7526 1.4492 70.4026 13.8281 6.1188 3.6620 0.8047 2.8422 1.6055 10.9035 1.1811 1.9679 6.7142 21.2572 25.7470 1.8470 2.8658 0.1819 0.5343 5.3541 27.2772 5.7434 35.5841 63.1043 11.1444 25.5414 0.1121 2.8856 15.4904 18.0681 3.7927 0.3606 15.3272 11.3192 0.1632 4.4730 6.1223 2.1948 7.9929 19.6379 15.7690 21.9111 65.2953 1.3010 29.5408 5.2008 3.2195 5.0372 2.6671 13.2845 2.4367 6.7909 23.8320 9.5948 35.7291 47.8518 5.5449 16.6899 58.3752 5.2996 7.1579 15.6109 5.6396 7.6357 6.7863 21.7745 35.0893 9.5013 94.0292 64.5016 159.5893 7.8846 6.8517 73.0088 29.8945 25.5716 37.1818 34.4658 33.7766 34.9041 6.1010 117.0072 22.0584 22.5883 6.0978 65.3654 55.8605 13.3170 31.7691 3.7357 30.4108 2.0273 0.9832 15.2584 35.3866 9.9703 1.9217
temp: 298.150 k
press: 1.00000 atm
elementType: 16 8 7 7 7 6 6 6 6 6 6 6 6 6 6 6 6 6 6 6 6 6 6 6 1 1 1 1 1 1 1 1 1 1 1 1 1 1 1 1 1 1 1 1 1 1 1
symmnumber: 1
zpe: 1021664.3 jmol-1
zpe.correction: 0.389131 hartree
zpe.thermalcorrener: 0.410280 hartree
zpe.thermalcorrenthalpy: 0.411224 hartree
zpe.thermalcorrgfe: 0.337175 hartree
zpe.sumelectzpe: -1373.580815 hartree
zpe.sumelectthermal: -1373.559666 hartree
zpe.sumelectthermalent: -1373.558722 hartree
zpe.sumelectthermalfe: -1373.632771 hartree
dipole: 3.9481 -0.6157 0.3748
dipole: 4.0134
quadrupole: -149.2239 -148.8335 -145.1342
quadrupole: 7.4500 3.5076 9.4099
quadrupole: -1.4934 -1.1030 2.5964 7.4500 3.5076 9.4099
hfenergy: -1373.9699462 hartree
pointgroup: C01 [X(C19H23N3O1S1)]
dipole: -1.5246129 0.1775814 -0.3704321 debye
polarizability: 283.35277|-35.211002|237.8607034|29.5903461|-53.2655733|213.9033084 unknown
InChI: InChI=1S/C19H23N3OS/c24-19(21-10-12-23-13-11-21)14-17-16-8-4-5-9-18(16)22(20-17)15-6-2-1-3-7-15/h1-3,6-7H,4-5,8-14H2
charge 0 multiplicity 1
47 atoms
S  4.066687 -1.588385 1.078675
O  2.56621 3.40264 0.496475
N  -1.229943 -0.68255 -0.915613
N  0.047696 -0.47282 -1.462764
N  3.314772 0.695909 -0.223203
C  0.122128 -2.134872 0.14626
C  -1.206563 -1.692108 0.054834
C  0.564217 -3.251188 1.062432
C  -2.367928 -2.279482 0.81499
C  -0.5565 -3.585035 2.082056
C  -1.946233 -3.655487 1.400559
C  0.858111 -1.355332 -0.805351
C  2.33615 -1.409353 -1.132115
C  3.225877 -0.668821 -0.118729
C  4.163002 1.506153 0.688479
C  2.557561 1.551739 -1.177432
C  -2.325173 0.076178 -1.437826
C  3.293962 2.533165 1.438058
C  1.722849 2.585995 -0.389637
C  -3.459869 0.370271 -0.640666
C  -2.253635 0.555626 -2.770785
C  -4.524828 1.118936 -1.187436
C  -3.319125 1.310444 -3.301012
C  -4.46352 1.591886 -2.517434
H  0.801501 -4.155056 0.463166
H  1.501888 -2.977315 1.581332
H  -2.668546 -1.612207 1.64949
H  -3.256564 -2.392823 0.164802
H  -0.331363 -4.545429 2.582008
H  -0.580503 -2.807669 2.872107
H  -2.712418 -3.989973 2.125001
H  -1.915627 -4.407258 0.587281
H  2.495734 -1.018837 -2.154617
H  2.673267 -2.457424 -1.120563
H  4.919254 2.035594 0.076927
H  4.668649 0.819897 1.389461
H  1.872995 0.954595 -1.796171
H  3.285386 2.079536 -1.825262
H  2.575474 2.005639 2.100879
H  3.922118 3.209891 2.039805
H  1.239924 3.296391 -1.079828
H  0.944589 2.056478 0.199168
H  -3.504404 0.048047 0.402558
H  -1.364482 0.330125 -3.364381
H  -5.39739 1.343905 -0.564358
H  -3.258094 1.675151 -4.332292
H  -5.290795 2.174932 -2.93553
