program: Gaussian 09
title: 000216077
version: EM64L-G09RevD.01
frameworkgroup: C1[X(C20H19NO2)]
method: RPBEPBE
basis: SDD
operation: Freq
keyword: #p
keyword: freq=noraman
keyword: PBEPBE/SDD
title: #p freq=noraman PBEPBE/SDD
converged: NO YES NO NO
title: Mulliken charges:
elementType: O O N C C C C C C C C C C C C C C C C C C C C H H H H H H H H H H H H H H H H H H H
charge: -0.452882 -0.336835 -0.129625 -0.150022 0.057490 -0.663587 0.424219 -0.397665 -0.568560 0.135983 0.377799 0.145377 -0.426488 -0.609073 -0.059534 0.226478 -0.456287 -0.354949 -0.243449 -0.266580 0.204167 -0.518866 -0.507778 0.204165 0.213500 0.250230 0.239051 0.192043 0.238937 0.208072 0.210661 0.232032 0.249800 0.233685 0.290052 0.224255 0.224509 0.387286 0.226333 0.242477 0.227471 0.276105
chargesum: 0.00000
title: Mulliken charges with hydrogens summed into heavy atoms:
elementType: O O N C C C C C C C C C C C C C C C C C C C C
charge: -0.065596 -0.336835 -0.129625 0.054143 0.057490 -0.199857 0.424219 0.033428 -0.121551 0.135983 0.377799 0.145377 0.016205 -0.359273 -0.059534 0.226478 -0.222602 -0.064896 -0.019194 -0.042070 0.204167 0.177415 -0.231673
polarizability: 2.87801243e+02 4.04916978e+00 2.98390803e+02 1.32613402e+01 4.39892613e+00 1.18932199e+02
1716.lowfreq: -5.0590 -2.1296 0.0006 0.0007 0.0007 5.0930 36.3818 49.1624 55.1805
frequency: 36.3686 49.1301 55.1774 67.9553 95.6399 111.4070 123.1371 154.0151 173.6798 192.1590 215.5822 225.0698 240.8524 262.3449 277.0912 298.0529 316.6247 330.9593 335.5341 352.7444 369.1205 388.2308 409.7913 438.9726 447.6910 466.0420 496.5045 522.7393 532.1820 537.9366 573.5328 594.0754 613.1774 627.0936 634.6747 652.9590 661.2347 678.9453 712.8301 738.8306 748.8508 776.3577 785.7124 801.5575 827.7196 849.1921 856.7572 880.0655 929.5851 942.6335 949.5814 952.7556 973.4802 989.4485 1003.6310 1014.7330 1035.2956 1046.8444 1079.3591 1087.0587 1092.7284 1117.6858 1127.6922 1137.0076 1157.3172 1160.7024 1164.1600 1177.2366 1195.5423 1209.2168 1222.2492 1231.1131 1242.3089 1255.5864 1270.4880 1279.0430 1296.1912 1303.9410 1317.8934 1327.9683 1344.1992 1356.6608 1377.5721 1386.7730 1403.4685 1431.6240 1442.3735 1446.7265 1449.2291 1454.7706 1461.7922 1461.9749 1464.4295 1477.1167 1477.8320 1498.3235 1580.1319 1605.0534 1610.4936 1618.6235 2145.2375 2781.5931 2826.0130 2853.4501 2966.3527 2977.2830 2981.4522 3030.8389 3036.5255 3051.9395 3052.6799 3056.3054 3114.7601 3126.6367 3131.3821 3143.6439 3154.0933 3194.4505 3427.9766 3472.8743
redmass: 4.9599 3.6038 3.3216 4.1591 4.1226 4.2206 4.8236 3.5803 3.0454 2.5500 1.4898 3.1538 3.2605 3.4051 2.6918 6.3766 3.1247 4.2525 4.5682 4.8389 4.7801 3.9622 4.9306 3.6472 3.8018 3.4164 3.8843 1.1548 3.5954 4.2235 4.6169 4.2083 5.1457 1.2337 5.7355 5.3242 1.2854 4.1195 3.2014 3.4887 1.7507 4.4130 2.6448 4.2866 2.3175 1.7316 3.3204 1.5787 2.7598 2.3858 3.6552 1.4649 2.2220 1.3295 3.7329 2.2339 2.6721 2.2822 2.5195 3.3142 3.3981 1.2556 2.2332 2.4991 1.6426 1.5202 1.6796 1.1333 1.2799 1.6431 2.0041 1.8492 1.3274 1.4792 1.9803 1.4708 1.6584 1.5393 1.7099 1.8832 1.8927 1.4260 4.1352 1.5776 3.1363 2.6736 1.4368 1.4691 1.1484 1.6452 1.1634 2.6031 1.0530 1.0896 1.1671 2.8796 6.4479 7.7336 6.5241 7.3183 6.0288 1.0781 1.0710 1.0711 1.0324 1.0598 1.0627 1.1005 1.0843 1.0892 1.0958 1.1044 1.0868 1.1002 1.0901 1.0911 1.0983 1.0942 1.1593 1.0640
irintensity: 0.0940 1.7757 4.2848 0.3990 1.1270 0.1888 1.1705 1.4708 3.0755 2.5264 1.5903 0.3226 2.6085 0.8014 1.1483 0.0563 6.0262 3.6377 4.9567 1.4245 2.2964 1.3776 4.0841 0.7112 2.5534 3.2786 2.9127 112.4876 24.6859 11.4868 0.5786 2.3623 3.9783 75.0286 8.8497 5.9195 61.6674 4.1574 0.9943 3.3005 41.8552 7.7385 35.5244 18.1011 37.8050 22.3505 15.6447 5.1235 2.5808 4.8100 4.4277 2.2252 12.2925 0.3215 44.6798 19.8799 11.0475 2.4657 18.5086 30.5844 55.3260 0.1297 63.8626 10.9629 3.8106 45.1504 8.8447 0.6915 8.5486 7.0350 27.8741 94.3643 30.4124 13.0073 30.0036 71.1454 61.0677 39.2667 9.0112 37.9754 19.8512 4.9736 4.6215 19.8285 15.5272 46.5376 30.4257 31.9776 4.6471 17.0793 6.2139 62.8762 13.9286 14.6461 19.7269 44.9316 4.0768 8.1562 1.2684 10.1453 2.8134 45.5646 68.2407 116.0006 67.4006 37.7507 23.4169 29.1835 8.3940 21.4794 51.6338 43.0852 7.1055 24.2488 20.1579 9.7374 44.2824 6.8455 72.3454 109.4425
temp: 298.150 k
press: 1.00000 atm
elementType: 8 8 7 6 6 6 6 6 6 6 6 6 6 6 6 6 6 6 6 6 6 6 6 1 1 1 1 1 1 1 1 1 1 1 1 1 1 1 1 1 1 1
symmnumber: 1
zpe: 883450.8 jmol-1
zpe.correction: 0.336489 hartree
zpe.thermalcorrener: 0.356470 hartree
zpe.thermalcorrenthalpy: 0.357414 hartree
zpe.thermalcorrgfe: 0.288595 hartree
zpe.sumelectzpe: -977.014580 hartree
zpe.sumelectthermal: -976.994599 hartree
zpe.sumelectthermalent: -976.993654 hartree
zpe.sumelectthermalfe: -977.062474 hartree
dipole: 0.7469 -3.4496 0.6128
dipole: 3.5823
quadrupole: -121.2477 -112.5655 -139.1821
quadrupole: -12.4031 -0.9112 0.8453
quadrupole: 3.0841 11.7663 -14.8504 -12.4031 -0.9112 0.8453
hfenergy: -977.3510684 hartree
pointgroup: C01 [X(C20H19N1O2)]
dipole: 0.0900905 1.3708059 -0.3149189 debye
polarizability: 288.7766365|-6.2070622|296.7731217|-15.805187|-6.8469381|119.5744872 unknown
InChI: InChI=1S/C20H19NO2/c1-3-9-21-10-8-14-12-17(23-2)20(22)19-15-7-5-4-6-13(15)11-16(21)18(14)19/h1,4-7,12,16,22H,8-11H2,2H3
charge 0 multiplicity 1
42 atoms
O  3.658644 0.238657 -0.125114
O  3.401695 2.831855 -0.167591
N  -2.589699 0.214096 -0.023266
C  -1.294988 -0.488289 -0.25741
C  -0.088223 0.460213 -0.215274
C  -1.041444 -1.610982 0.777701
C  -0.247535 1.862473 -0.224967
C  -2.673561 1.490113 -0.780289
C  -1.636685 2.477633 -0.235347
C  1.219736 -0.142202 -0.175265
C  0.219456 -2.364948 0.395437
C  1.340172 -1.6244 -0.096463
C  -3.742726 -0.673795 -0.346505
C  0.892554 2.707793 -0.211315
C  2.342045 0.723373 -0.172875
C  2.169481 2.136244 -0.18756
C  0.295169 -3.769985 0.509202
C  2.512409 -2.337548 -0.472937
C  1.467876 -4.466688 0.139864
C  2.574219 -3.742358 -0.358166
C  -5.049978 -0.092015 0.011089
C  3.356393 4.292837 -0.137865
C  -6.165918 0.353981 0.284707
H  -1.303442 -0.969961 -1.275881
H  -1.88904 -2.31606 0.832071
H  -0.94289 -1.137702 1.775279
H  -3.691688 1.896653 -0.652552
H  -2.507753 1.326032 -1.87644
H  -1.930654 2.760356 0.79458
H  -1.643306 3.402515 -0.844083
H  -3.76114 -0.938714 -1.436957
H  -3.627433 -1.62355 0.205043
H  0.756108 3.794132 -0.220442
H  -0.573129 -4.322347 0.889237
H  3.376541 -1.784402 -0.843487
H  1.514274 -5.557619 0.232743
H  3.487648 -4.269492 -0.655872
H  4.262626 1.02921 -0.069971
H  2.86581 4.690865 -1.046601
H  4.405907 4.620426 -0.107484
H  2.823654 4.653514 0.762771
H  -7.134584 0.746391 0.534356
