program: Gaussian 09
title: 000216074
version: EM64L-G09RevD.01
frameworkgroup: C1[X(C20H23NO2)]
method: RPBEPBE
basis: SDD
operation: Freq
keyword: #p
keyword: freq=noraman
keyword: PBEPBE/SDD
title: #p freq=noraman PBEPBE/SDD
converged: YES YES NO NO
title: Mulliken charges:
elementType: O O N C C C C C C C C C C C C C C C C C C C C H H H H H H H H H H H H H H H H H H H H H H H
charge: -0.452593 -0.336876 -0.142514 -0.161840 0.062123 -0.658838 -0.397627 0.423113 -0.571703 0.129433 0.390560 -0.324312 0.144748 -0.611985 -0.059347 -0.377093 0.225810 -0.460536 -0.355790 -0.243581 -0.267311 -0.673224 -0.519003 0.211020 0.217084 0.242426 0.210995 0.193443 0.233701 0.205418 0.193827 0.195119 0.249023 0.195445 0.195437 0.234086 0.288662 0.223116 0.223708 0.239795 0.208212 0.196696 0.386548 0.225921 0.241961 0.226743
chargesum: 0.00000
title: Mulliken charges with hydrogens summed into heavy atoms:
elementType: O O N C C C C C C C C C C C C C C C C C C C C
charge: -0.066045 -0.336876 -0.142514 0.049180 0.062123 -0.199328 0.006811 0.423113 -0.132584 0.129433 0.390560 0.064635 0.144748 -0.362962 -0.059347 0.013789 0.225810 -0.226450 -0.067128 -0.020465 -0.043603 -0.028521 0.175621
polarizability: 2.79585661e+02 1.12881614e+01 2.98972558e+02 2.62968461e+00 -1.52123743e+00 1.32397943e+02
1716.lowfreq: -9.8412 -5.2045 -3.2229 0.0003 0.0005 0.0007 23.9448 35.0048 51.4043
frequency: 23.8399 34.9153 51.4036 73.0779 90.4487 100.1079 117.2792 136.5152 152.9900 188.5624 195.8671 219.6149 232.7813 241.8981 260.5514 277.4655 294.1919 317.9727 331.1002 336.5928 358.9858 381.8414 398.1980 410.7138 441.4921 451.6655 467.2388 494.6199 525.1890 530.2480 536.6744 544.0765 588.5396 605.4158 631.8034 650.3069 676.0038 709.3544 737.4901 746.5648 751.5308 785.3302 795.2795 805.2865 827.6229 847.4345 856.3789 864.5860 879.7903 907.4166 931.4330 951.9020 956.0902 988.4830 989.1142 992.3865 1024.7120 1041.0104 1045.1328 1073.5267 1090.9408 1094.0932 1100.0976 1101.8768 1117.0534 1130.2211 1151.3727 1157.7069 1160.5616 1176.2045 1178.9809 1198.5908 1212.2547 1222.0362 1230.9286 1247.1106 1261.3519 1266.4330 1275.4251 1288.7062 1297.4685 1303.6889 1316.9685 1328.7016 1340.7617 1344.6502 1363.0806 1375.0280 1378.5228 1389.0762 1403.1094 1430.6378 1441.6104 1446.8159 1449.7707 1456.6535 1461.0950 1463.0075 1463.1926 1468.9084 1476.5202 1476.9233 1479.8339 1489.6342 1497.6178 1579.2113 1604.3897 1610.4335 1618.0678 2792.1783 2844.1676 2863.2547 2965.3153 2973.2009 2973.8089 2977.9151 2978.2629 3019.7325 3027.3392 3043.1867 3046.7801 3054.8289 3056.4014 3068.8307 3086.3912 3114.4372 3125.8866 3130.2331 3142.7904 3153.0906 3194.2436 3471.6117
redmass: 2.9147 3.9279 3.5971 3.7991 3.0201 3.3331 3.6934 3.1529 3.5562 1.7156 1.8827 1.5454 2.0236 3.1287 3.3129 2.6046 2.8475 4.1391 4.5244 4.4688 4.2110 3.7477 2.5054 4.5163 3.1215 3.7789 3.2521 3.4511 2.3333 1.2438 3.7979 4.0166 4.1947 4.4892 5.6332 5.5246 4.2914 3.4067 2.8680 2.2649 1.7113 2.6241 2.9151 2.5459 2.1059 1.6866 3.2821 2.3411 1.5064 1.4856 3.0375 1.7382 1.9813 1.9025 1.4130 2.9063 3.0878 1.9428 2.2929 2.3874 3.0528 2.3565 2.7848 2.3780 1.2560 2.0869 1.9655 1.3205 1.5300 1.1770 1.9186 1.4957 1.6819 1.9664 1.8937 1.3981 1.3974 1.2942 2.2041 1.4004 1.6930 1.4896 1.6813 1.8361 1.5183 1.7533 1.3627 2.3441 1.7660 1.4820 2.8943 2.6541 1.4076 1.5038 1.3016 1.5021 2.5146 1.1022 1.0627 1.0629 1.1129 1.1206 1.0919 1.0586 2.8933 6.4221 7.7814 6.5671 7.2555 1.0783 1.0720 1.0714 1.0324 1.0582 1.0436 1.0640 1.0549 1.0977 1.1001 1.0878 1.0908 1.1043 1.0944 1.0986 1.1000 1.0866 1.1001 1.0902 1.0910 1.0984 1.0941 1.0640
irintensity: 0.0628 0.1051 5.5514 0.2705 0.6267 0.7618 0.7061 0.9069 2.0736 1.1001 1.3905 1.7418 0.2808 2.1204 1.7348 0.8922 0.1541 0.5061 4.5612 3.7061 2.4846 0.6212 1.0173 2.4220 1.6011 1.7611 2.0380 0.7003 5.9743 126.5493 1.6940 15.9315 1.0534 8.1935 6.1485 9.7262 1.6837 0.8610 4.9394 11.0906 39.5688 31.1006 6.6055 16.0698 35.5995 22.5530 15.9871 1.6606 3.3533 9.0016 3.8682 3.2654 8.5476 9.8288 0.6012 56.2713 21.7353 7.6578 1.7320 12.5081 34.9661 21.7145 32.4118 13.4073 0.1555 69.1615 8.7309 3.8767 30.2829 0.3104 3.9236 10.9875 1.9979 24.1360 89.6021 26.6638 16.7624 26.0312 51.2630 38.2208 57.0465 36.9738 6.6296 24.7493 4.0224 22.3530 2.5048 17.9656 11.2695 19.9462 18.0844 40.5076 26.6371 23.8058 27.3774 7.8722 60.5443 3.9911 11.4629 1.4053 28.8455 13.4006 10.9401 17.5704 44.5465 3.5565 7.5826 1.4486 9.6953 45.0365 61.1574 141.6349 67.5052 47.1242 39.5624 26.2466 38.9937 22.8323 34.4974 32.4642 33.3041 43.6745 40.5383 74.9617 43.7656 6.1722 24.6367 21.0888 10.3807 45.3790 6.6378 107.7002
temp: 298.150 k
press: 1.00000 atm
elementType: 8 8 7 6 6 6 6 6 6 6 6 6 6 6 6 6 6 6 6 6 6 6 6 1 1 1 1 1 1 1 1 1 1 1 1 1 1 1 1 1 1 1 1 1 1 1
symmnumber: 1
zpe: 1007251.2 jmol-1
zpe.correction: 0.383642 hartree
zpe.thermalcorrener: 0.404309 hartree
zpe.thermalcorrenthalpy: 0.405253 hartree
zpe.thermalcorrgfe: 0.334351 hartree
zpe.sumelectzpe: -979.437978 hartree
zpe.sumelectthermal: -979.417310 hartree
zpe.sumelectthermalent: -979.416366 hartree
zpe.sumelectthermalfe: -979.487269 hartree
dipole: -0.5255 -3.6729 -0.4806
dipole: 3.7413
quadrupole: -119.1780 -120.0289 -141.1763
quadrupole: 13.6880 -3.0227 -0.5950
quadrupole: 7.6164 6.7655 -14.3819 13.6880 -3.0227 -0.5950
hfenergy: -979.8216196 hartree
pointgroup: C01 [X(C20H23N1O2)]
dipole: -0.1765247 1.4504751 -0.1776367 debye
polarizability: 275.2620231|4.8151768|303.3205334|-0.4934716|2.5586837|132.3736048 unknown
InChI: InChI=1S/C20H23NO2/c1-3-9-21-10-8-14-12-17(23-2)20(22)19-15-7-5-4-6-13(15)11-16(21)18(14)19/h4-7,12,16,22H,3,8-11H2,1-2H3
charge 0 multiplicity 1
46 atoms
O  3.566955 0.239507 0.343195
O  3.352963 2.835689 0.464592
N  -2.662142 0.332444 -0.227592
C  -1.354314 -0.370022 -0.351872
C  -0.147437 0.549063 -0.114038
C  -1.229155 -1.550159 0.642136
C  -2.635921 1.668685 -0.871839
C  -0.2854 1.951047 -0.030348
C  -1.658972 2.591591 -0.134208
C  1.140432 -0.08254 0.017868
C  0.049803 -2.31205 0.343895
C  -3.807555 -0.475781 -0.733353
C  1.22692 -1.569337 0.009888
C  0.85906 2.768436 0.162395
C  2.269191 0.75539 0.19765
C  -5.142687 -0.130096 -0.032998
C  2.119059 2.169102 0.269883
C  0.090891 -3.722736 0.375989
C  2.418033 -2.284542 -0.295794
C  1.28231 -4.422323 0.077958
C  2.444323 -3.694926 -0.264763
C  -5.138568 -0.492355 1.466432
C  3.323436 4.29101 0.596967
H  -1.243992 -0.796292 -1.387512
H  -2.09644 -2.229457 0.576213
H  -1.219402 -1.131349 1.668934
H  -3.654457 2.094271 -0.836966
H  -2.344057 1.594038 -1.951728
H  -2.059643 2.789732 0.879724
H  -1.591406 3.565588 -0.656939
H  -3.595468 -1.546389 -0.562587
H  -3.919944 -0.350106 -1.839923
H  0.739786 3.855266 0.221969
H  -5.358945 0.949976 -0.153049
H  -5.958863 -0.670268 -0.554523
H  -0.819991 -4.277037 0.633828
H  3.323638 -1.729822 -0.545565
H  1.300928 -5.517765 0.105606
H  3.373264 -4.223972 -0.505926
H  -4.288024 0.000906 1.968953
H  -6.074764 -0.176309 1.962127
H  -5.031066 -1.584812 1.610093
H  4.173183 1.011031 0.516008
H  2.93234 4.763227 -0.324554
H  4.368449 4.5950 0.75629
H  2.706649 4.59684 1.463779
