program: Gaussian 09
title: 000216072
version: EM64L-G09RevD.01
frameworkgroup: C1[X(C17H20N2O)]
method: RPBEPBE
basis: SDD
operation: Freq
keyword: #p
keyword: freq=noraman
keyword: PBEPBE/SDD
title: #p freq=noraman PBEPBE/SDD
converged: YES YES NO NO
title: Mulliken charges:
elementType: O N N C C C C C C C C C C C C C C C C C H H H H H H H H H H H H H H H H H H H H
charge: -0.289498 -0.211219 -0.086833 -0.385317 -0.554366 0.412594 0.214526 -0.539231 -0.484165 -0.504362 0.485038 0.177350 -0.447337 -0.376410 0.053127 -0.216963 -0.227122 -0.697262 -0.697154 -0.243801 0.221514 0.241343 0.232304 0.236897 0.219200 0.236506 0.253324 0.247104 0.232185 0.256995 0.230007 0.227119 0.227718 0.202170 0.229610 0.219411 0.203397 0.257681 0.213973 0.229946
chargesum: 0.00000
title: Mulliken charges with hydrogens summed into heavy atoms:
elementType: O N N C C C C C C C C C C C C C C C C C
charge: -0.289498 -0.211219 -0.086833 0.077540 -0.085165 0.412594 0.214526 -0.083525 -0.230841 -0.257258 0.485038 0.177350 -0.215152 -0.119415 0.283134 0.010155 0.000596 -0.046071 -0.022103 -0.013855
polarizability: 2.96456364e+02 3.67149373e+00 1.66412381e+02 -6.16428536e+00 8.79103173e+00 1.53978663e+02
1716.lowfreq: -0.0009 -0.0008 -0.0007 1.2950 3.4723 6.3708 19.0579 33.4491 39.3270
frequency: 18.9397 33.3464 39.3240 53.4266 63.8000 112.5180 122.4256 145.3776 150.3044 177.3063 188.1574 217.5649 233.6244 270.7456 278.4088 309.0251 313.2658 352.8859 401.7344 405.4147 421.5653 446.1504 462.2398 467.6887 538.1517 589.8347 615.9581 631.4319 645.7993 655.9956 705.7009 722.8454 737.6464 744.2473 769.5839 793.5809 805.7456 830.5059 838.1875 859.2139 889.3463 904.3674 912.0043 922.0196 938.4213 940.8409 955.0453 981.7592 988.1220 990.4800 998.8072 1019.1116 1027.4271 1055.3105 1083.4363 1103.8569 1121.0814 1153.0592 1163.1629 1171.7603 1179.6370 1180.9433 1183.3314 1188.2644 1203.2861 1214.6793 1253.6899 1264.8995 1278.4155 1300.5630 1306.5880 1313.9784 1330.7718 1342.6222 1354.0268 1373.2711 1374.7207 1387.8248 1391.7580 1430.5475 1442.9595 1454.6825 1458.5772 1462.7941 1463.6635 1472.6930 1483.7284 1484.4074 1488.5368 1507.6577 1564.4254 1595.9904 1615.0671 1619.5954 2913.6849 2928.1271 2984.6408 2989.1019 2989.3914 3026.6822 3029.3907 3051.9086 3065.1279 3077.9564 3089.6234 3095.5627 3105.1045 3113.7423 3123.8499 3124.5368 3135.8274 3146.6454 3163.5175 3174.3036
redmass: 4.3470 3.8009 3.3209 4.4101 3.1598 3.6859 3.3561 2.3704 4.1184 2.6026 1.1613 3.4860 1.1410 4.3729 3.3274 4.1445 2.5668 3.3469 2.7368 2.8323 3.0739 3.3545 3.1513 3.0052 6.4838 5.0482 6.2006 5.3590 4.0231 8.2659 2.0691 3.2249 3.8682 1.6798 4.3682 2.8735 3.9707 1.6600 2.0185 1.2475 2.6551 1.4397 1.3708 1.2297 2.1736 1.5323 2.3122 1.3855 2.7832 5.8559 1.3646 2.4095 2.0850 1.6687 1.5601 1.7619 4.3486 2.0366 1.4074 1.0593 1.9364 2.1277 1.1481 1.7681 1.4858 2.9400 1.3253 2.4181 1.4226 1.8216 1.4868 1.3828 1.7134 1.6301 1.4958 1.6501 1.7419 4.8704 1.2549 3.8784 2.1478 1.0556 1.1325 1.1486 1.0654 1.0513 1.7420 1.8085 1.0493 1.9286 8.5098 6.2015 6.1817 7.0347 1.0698 1.0708 1.0358 1.0585 1.0424 1.0887 1.0862 1.0915 1.0993 1.0991 1.0986 1.1000 1.1000 1.0876 1.0859 1.0922 1.0910 1.0960 1.1015 1.0926
irintensity: 0.0421 0.3367 0.7885 2.9617 0.3247 1.8545 0.2885 1.6576 2.7495 1.5883 0.9084 3.2890 0.3707 16.1718 5.1572 2.0401 1.0492 7.1260 1.2804 0.3340 5.6693 3.3642 9.5749 0.5541 3.7829 2.8470 1.2353 6.5333 6.6696 9.7845 38.7281 0.9570 4.6570 38.5667 19.4759 7.1662 3.2206 42.1644 1.9084 0.3135 0.7267 7.9745 6.0064 3.2944 30.3945 6.3460 83.0221 0.3886 4.0650 1.1063 0.9760 12.2993 28.7845 3.8263 18.8920 168.1001 59.2815 11.4102 3.5786 0.3260 53.6902 193.7497 0.5852 54.0902 2.0098 26.3910 32.3634 49.6076 15.1954 65.5980 99.7782 8.2758 57.0643 15.7346 35.5738 34.7056 17.8803 12.0856 40.3278 84.0771 36.5581 4.8419 45.7253 11.8501 7.1917 2.0354 32.4746 70.5258 20.9753 74.1183 44.1548 7.2749 85.6096 418.4621 61.4122 93.8397 21.1686 57.1330 16.9982 8.4452 5.8487 35.1344 29.1225 10.5686 65.1402 31.3567 25.6076 9.1235 1.1251 27.7783 11.5131 38.6479 27.8429 6.8807
temp: 298.150 k
press: 1.00000 atm
elementType: 8 7 7 6 6 6 6 6 6 6 6 6 6 6 6 6 6 6 6 6 1 1 1 1 1 1 1 1 1 1 1 1 1 1 1 1 1 1 1 1
symmnumber: 1
zpe: 871996.4 jmol-1
zpe.correction: 0.332126 hartree
zpe.thermalcorrener: 0.350709 hartree
zpe.thermalcorrenthalpy: 0.351653 hartree
zpe.thermalcorrgfe: 0.283459 hartree
zpe.sumelectzpe: -843.075546 hartree
zpe.sumelectthermal: -843.056963 hartree
zpe.sumelectthermalent: -843.056019 hartree
zpe.sumelectthermalfe: -843.124212 hartree
dipole: 2.9883 0.8552 -0.5301
dipole: 3.1532
quadrupole: -109.4698 -115.9631 -114.1646
quadrupole: 1.8702 -1.6378 0.7559
quadrupole: 3.7293 -2.7639 -0.9654 1.8702 -1.6378 0.7559
hfenergy: -843.4076714 hartree
pointgroup: C01 [X(C17H20N2O1)]
dipole: 1.1662851 -0.4013534 0.1328749 debye
polarizability: 296.0604608|-7.9627988|161.7980762|6.7653703|10.4923341|158.9888711 unknown
InChI: InChI=1S/C17H20N2O/c1-13(2)20-17-10-16-15(11-18-17)8-9-19(16)12-14-6-4-3-5-7-14/h3-7,10-11,13H,8-9,12H2,1-2H3
charge 0 multiplicity 1
40 atoms
O  -3.578254 1.133081 0.477047
N  0.939395 -0.783538 0.26845
N  -3.200091 -1.012863 -0.471598
C  1.40007 -2.178179 0.010215
C  0.247395 -2.811194 -0.830261
C  -0.444745 -0.70405 0.102958
C  -0.933607 -1.897811 -0.52467
C  1.729241 0.10104 1.125298
C  -1.33928 0.329289 0.439577
C  -2.297513 -2.005442 -0.788639
C  3.091756 0.461969 0.531422
C  -2.708119 0.105718 0.119287
C  4.230484 0.563534 1.366411
C  3.22596 0.742628 -0.851432
C  -5.036904 0.963088 0.165022
C  5.482289 0.949183 0.833751
C  4.475608 1.123785 -1.387155
C  -5.758375 1.884114 1.153021
C  -5.287782 1.319383 -1.3081
C  5.608516 1.230854 -0.54568
H  1.533014 -2.7145 0.976414
H  2.369783 -2.176899 -0.516128
H  0.072278 -3.86583 -0.557271
H  0.494545 -2.782108 -1.909096
H  1.880005 -0.354408 2.130963
H  1.145388 1.027396 1.282763
H  -1.049703 1.262316 0.927451
H  -2.721206 -2.896895 -1.265311
H  4.139886 0.339413 2.437098
H  2.345544 0.653603 -1.498796
H  -5.289882 -0.098661 0.340015
H  6.355859 1.02415 1.491165
H  4.567286 1.339665 -2.457762
H  -6.851952 1.808897 1.010906
H  -5.519058 1.605375 2.193671
H  -5.456876 2.935246 0.996397
H  -6.367025 1.244519 -1.538798
H  -4.742849 0.624524 -1.968023
H  -4.957574 2.353035 -1.516322
H  6.578192 1.526972 -0.961262
