program: Gaussian 09
title: 000216066
version: EM64L-G09RevD.01
frameworkgroup: C1[X(C16H15N)]
method: RPBEPBE
basis: SDD
operation: Freq
keyword: #pfreq=noraman
keyword: PBEPBE/SDD
title: #p freq=noraman PBEPBE/SDD
converged: NO YES NO NO
title: Mulliken charges:
elementType: N C C C C C C C C C C C C C C C C H H H H H H H H H H H H H H H
charge: -0.246668 -0.348765 -0.633127 -0.467674 -0.567080 0.418800 0.368690 0.406787 0.307886 -0.461383 -0.461800 -0.446841 -0.361391 -0.236769 -0.237342 -0.244877 -0.255545 0.219162 0.251614 0.217507 0.222561 0.236378 0.226145 0.263776 0.237823 0.234688 0.225590 0.231406 0.224045 0.224621 0.225943 0.225842
chargesum: 0.00000
title: Mulliken charges with hydrogens summed into heavy atoms:
elementType: N C C C C C C C C C C C C C C C C
charge: 0.017108 -0.129603 -0.381514 -0.027606 -0.104557 0.418800 0.368690 0.406787 0.307886 -0.223559 -0.227112 -0.221251 -0.129985 -0.012725 -0.012721 -0.018934 -0.029704
polarizability: 2.04928573e+02 2.37458867e+00 1.63764070e+02 -6.13676053e+00 -1.60738461e+01 1.30784027e+02
1716.lowfreq: -6.9846 -0.0008 -0.0004 0.0004 8.8840 11.0782 46.1000 87.2993 129.5470
frequency: 46.0682 87.2614 129.5446 140.1825 176.1520 256.7340 306.9098 312.4416 322.7689 326.8482 402.3182 434.8500 445.4345 478.6959 505.0891 540.5552 558.2462 586.3102 601.4838 649.4539 680.1779 701.0351 722.9268 743.7059 757.1522 763.7883 785.7009 812.7665 825.6974 852.5301 869.0555 881.3158 909.1414 931.7385 946.9574 948.2595 967.3569 983.8602 984.6495 1012.8437 1027.7012 1041.3278 1059.2597 1097.2553 1104.2287 1115.5656 1170.0920 1173.0205 1180.3967 1185.0161 1198.6335 1203.1434 1209.3201 1215.9324 1229.9417 1259.2663 1277.9805 1289.7577 1313.6728 1336.2168 1348.0821 1368.8609 1383.3660 1395.3267 1432.0112 1441.5583 1444.9606 1450.0986 1477.1584 1485.5396 1488.5003 1589.6382 1593.7422 1610.8621 1614.5899 2957.3589 2969.5395 3001.6881 3007.1045 3022.0237 3033.1963 3108.5671 3111.3337 3115.8657 3117.2396 3134.6842 3136.3205 3157.0058 3158.9533 3432.3660
redmass: 4.2841 3.3614 3.3043 3.9554 2.6404 3.0252 3.8239 3.2182 3.4847 4.2962 4.0134 5.1567 2.9459 4.0953 3.9316 4.4531 3.8711 2.9360 3.5311 3.1599 4.1614 4.6988 2.5177 3.8951 1.5493 1.3578 3.4636 2.3957 2.9871 2.8599 1.6237 1.5152 3.0167 2.2243 1.5408 1.5123 2.5899 1.3227 1.3282 2.4987 2.3889 2.2622 1.9148 2.7469 2.2013 2.5727 1.1224 1.1411 2.0575 2.0384 1.3415 1.3826 1.2299 1.7098 1.4074 1.7072 1.4403 1.4734 1.5026 1.4056 1.4379 1.6468 5.0407 3.9172 1.6808 1.9893 1.2115 1.5495 1.6850 1.6486 1.9422 6.6508 6.6904 6.5240 6.5387 1.0602 1.0634 1.0886 1.0976 1.0864 1.0998 1.0873 1.0863 1.0893 1.0882 1.0928 1.0926 1.1002 1.1006 1.0751
irintensity: 0.1114 1.6255 0.3630 0.1673 7.5644 2.2927 1.1649 2.9844 3.7279 1.7490 0.8796 1.2205 5.1240 0.1351 19.4870 0.8359 2.5821 39.6589 20.2609 102.0252 13.0497 3.0884 13.9624 5.8236 35.6018 88.0174 3.5761 10.2252 3.6993 2.5181 1.3147 0.2075 12.0253 3.4339 0.5758 2.9999 5.5826 0.0349 0.0630 3.6721 5.7260 5.3230 0.6233 2.6454 4.6874 19.7422 0.5068 0.7287 4.6188 2.3651 5.1690 0.2197 6.8399 1.0334 0.5833 2.3059 3.1308 0.3684 1.0128 0.7578 2.1043 0.9033 1.3673 0.9298 8.3955 3.6913 13.7432 6.9551 10.0595 16.7333 12.3476 1.1467 0.8703 0.1150 0.6937 23.5184 59.7543 38.2698 46.9245 19.2156 43.4688 11.5946 11.5053 2.4358 3.4902 25.4495 32.4281 42.6031 33.6499 3.4954
temp: 298.150 k
press: 1.00000 atm
elementType: 7 6 6 6 6 6 6 6 6 6 6 6 6 6 6 6 6 1 1 1 1 1 1 1 1 1 1 1 1 1 1 1
symmnumber: 1
zpe: 697801.4 jmol-1
zpe.correction: 0.265779 hartree
zpe.thermalcorrener: 0.278217 hartree
zpe.thermalcorrenthalpy: 0.279161 hartree
zpe.thermalcorrgfe: 0.227216 hartree
zpe.sumelectzpe: -672.263885 hartree
zpe.sumelectthermal: -672.251447 hartree
zpe.sumelectthermalent: -672.250503 hartree
zpe.sumelectthermalfe: -672.302448 hartree
dipole: 1.0488 0.5437 -0.4153
dipole: 1.2523
quadrupole: -95.1505 -90.5339 -99.8910
quadrupole: 2.1683 3.0466 -5.8663
quadrupole: 0.0413 4.6579 -4.6992 2.1683 3.0466 -5.8663
hfenergy: -672.5296638 hartree
pointgroup: C01 [X(C16H15N1)]
dipole: -0.4128122 0.1751412 0.2040815 debye
polarizability: 204.8188681|-0.4447315|156.7539804|-7.3370962|20.905523|137.9038207 unknown
InChI: InChI=1S/C16H15N/c1-2-7-14-11(5-1)9-12-10-17-16(14)15-8-4-3-6-13(12)15/h1-8,12,16-17H,9-10H2
charge 0 multiplicity 1
32 atoms
N  -0.141056 1.071719 -2.029031
C  -0.778796 1.773394 0.354042
C  0.01288 -0.250514 -1.338261
C  -0.386464 2.214874 -1.101239
C  0.500865 1.50339 1.198184
C  -1.672659 0.545908 0.32619
C  -1.232941 -0.529282 -0.494454
C  1.308322 -0.298479 -0.52046
C  1.515312 0.498665 0.642516
C  -2.863165 0.413832 1.072644
C  -1.980267 -1.72523 -0.553236
C  2.331109 -1.187848 -0.937807
C  2.741242 0.368031 1.346264
C  -3.608641 -0.788938 1.019805
C  -3.165032 -1.85986 0.209093
C  3.543811 -1.309791 -0.228672
C  3.749454 -0.523832 0.927812
H  -1.312136 2.613467 0.839505
H  0.094039 -1.014904 -2.132529
H  -1.190517 2.844568 -1.526524
H  0.523615 2.843897 -1.034612
H  0.191993 1.171397 2.210496
H  1.023426 2.472278 1.337409
H  -0.893238 0.998447 -2.72813
H  -3.207181 1.246191 1.699473
H  -1.638593 -2.552418 -1.188315
H  2.170663 -1.790901 -1.840016
H  2.90276 0.983142 2.241245
H  -4.52971 -0.889639 1.605017
H  -3.740878 -2.791487 0.168437
H  4.317231 -2.005111 -0.57319
H  4.684454 -0.60297 1.493747
