program: Gaussian 09
title: 000216060
version: EM64L-G09RevD.01
frameworkgroup: C1[X(C6H16O6P2)]
method: RPBEPBE
basis: SDD
operation: Freq
keyword: #p
keyword: freq=noraman
keyword: PBEPBE/SDD
title: #p freq=noraman PBEPBE/SDD
converged: YES YES NO NO
title: Mulliken charges:
elementType: P P O O O O O O C C C C C C H H H H H H H H H H H H H H H H
charge: 1.285046 1.285046 -0.512139 -0.512137 -0.687025 -0.687026 -0.606834 -0.606836 -0.714976 -0.714976 -0.224494 -0.224494 -0.652156 -0.652156 0.320627 0.284245 0.284245 0.320626 0.237171 0.196371 0.237171 0.196371 0.397729 0.397728 0.208650 0.228961 0.238825 0.208650 0.228963 0.238824
chargesum: 0.00000
title: Mulliken charges with hydrogens summed into heavy atoms:
elementType: P P O O O O O O C C C C C C
charge: 1.285046 1.285046 -0.512139 -0.512137 -0.289297 -0.289297 -0.606834 -0.606836 -0.110104 -0.110104 0.209048 0.209047 0.024280 0.024281
polarizability: 1.42263066e+02 -7.66718880e-04 1.47926573e+02 -1.09487921e+00 -5.75731604e-05 1.10532584e+02
1716.lowfreq: -6.1208 0.0006 0.0011 0.0016 4.3718 6.4613 15.8048 23.8475 35.5377
frequency: 15.5721 23.7073 34.9422 60.2165 67.1339 73.1794 79.0521 89.5758 128.6063 136.5778 137.1456 189.3060 220.0116 231.2008 245.2404 253.5110 256.5295 269.2823 278.1553 314.8760 332.1248 340.0843 344.7741 378.8458 389.6701 393.9707 420.2915 600.5198 625.1242 690.2215 695.2628 717.8448 759.2010 789.7910 810.8889 811.1461 876.5060 884.0065 947.3177 983.3245 985.6802 1017.7402 1022.4790 1045.7227 1066.5443 1080.6834 1103.0525 1104.5794 1131.5928 1132.2341 1142.7551 1256.4134 1258.5504 1262.7070 1283.2273 1326.9776 1357.9226 1359.0621 1396.9006 1396.9381 1436.3517 1438.4751 1457.3849 1458.5856 1477.8013 1479.2195 1488.9731 1493.8594 2957.4355 2957.8085 2995.6723 2995.8104 3031.7591 3038.9184 3044.3996 3044.9806 3092.9706 3092.9880 3096.7971 3110.5088 3110.8619 3112.6060 3594.1751 3594.2665
redmass: 4.7311 4.0640 4.1315 1.9402 2.4718 3.6294 2.6571 4.7254 9.7600 4.5376 5.4329 5.8293 2.3139 2.3470 1.5875 1.9276 1.4825 3.6399 3.5491 1.8166 6.1477 1.4308 2.1259 5.2765 5.3791 4.7545 6.4604 6.6065 5.0699 8.3138 9.1586 6.2998 4.6494 1.2252 1.0953 1.0930 3.8481 3.8112 1.7488 1.4726 1.3656 2.5117 2.7102 4.1895 2.8409 4.5241 2.1020 2.2472 1.4343 1.4397 1.2776 1.1526 1.1396 1.1914 1.1493 1.3136 1.2542 1.2538 1.2399 1.2399 1.0745 1.0834 1.0398 1.0397 1.0545 1.0485 1.0784 1.0853 1.0629 1.0628 1.0366 1.0366 1.0601 1.0576 1.1001 1.1004 1.0983 1.0983 1.1038 1.1016 1.1016 1.1044 1.0661 1.0662
irintensity: 1.4120 0.0056 2.4555 8.1825 0.3880 0.1352 2.9714 4.0439 0.2139 0.0055 0.7237 8.7876 1.1116 0.8151 18.0586 9.8508 3.0308 1.2813 11.7044 92.1409 136.4718 40.8879 112.1200 1.3673 15.8675 12.6595 28.8007 21.5480 60.8828 161.1930 14.6793 302.9572 46.7935 19.7813 0.5448 5.5759 7.3483 264.5002 17.2508 20.1332 40.5417 22.8924 202.0621 0.2304 68.7258 118.3720 6.1769 19.3577 13.0120 1.9531 100.9899 7.4412 1.1666 35.9656 3.5849 0.2670 1.3521 9.1679 15.4240 31.7331 0.9051 32.0776 23.9220 0.1292 5.1463 6.8280 15.3660 2.6679 97.9947 9.3549 2.9251 36.1693 0.9410 6.3851 40.6592 2.6441 17.8852 35.1531 0.7564 69.0392 0.2429 0.1622 124.3355 11.5063
temp: 298.150 k
press: 1.00000 atm
elementType: 15 15 8 8 8 8 8 8 6 6 6 6 6 6 1 1 1 1 1 1 1 1 1 1 1 1 1 1 1 1
symmnumber: 1
zpe: 605484.5 jmol-1
zpe.correction: 0.230617 hartree
zpe.thermalcorrener: 0.250436 hartree
zpe.thermalcorrenthalpy: 0.251380 hartree
zpe.thermalcorrgfe: 0.179591 hartree
zpe.sumelectzpe: -1370.851059 hartree
zpe.sumelectthermal: -1370.831240 hartree
zpe.sumelectthermalent: -1370.830296 hartree
zpe.sumelectthermalfe: -1370.902084 hartree
dipole: -0.0001 5.5018 0.0000
dipole: 5.5018
quadrupole: -95.8446 -100.5376 -109.2402
quadrupole: 0.0001 -19.7361 -0.0003
quadrupole: 6.0295 1.3366 -7.3661 0.0001 -19.7361 -0.0003
hfenergy: -1371.0816754 hartree
pointgroup: C01 [X(C6H16O6P2)]
dipole: -0.0001335 2.164573 -0.0000056 debye
polarizability: 142.269418|0.0002665|147.9265728|-0.9985863|-0.000174|110.5262323 unknown
InChI: InChI=1S/C6H16O6P2/c1-3-11-13(7,8)5-6-14(9,10)12-4-2/h7,9H,3-6H2,1-2H3
charge 0 multiplicity 1
30 atoms
P  -2.249533 -1.018798 0.041037
P  2.249651 -1.018456 -0.041073
O  -2.396942 0.551198 -0.700698
O  2.396868 0.55156 0.700657
O  -3.052171 -0.865049 1.580075
O  3.052272 -0.864612 -1.580111
O  -2.784823 -2.16446 -0.917516
O  2.785079 -2.164049 0.917486
C  -0.472666 -1.114663 0.60705
C  0.472798 -1.114551 -0.60709
C  -2.299876 1.791158 0.122451
C  2.299639 1.791506 -0.122495
C  -2.70961 2.942712 -0.791578
C  2.709278 2.943111 0.791513
H  -0.367855 -2.038642 1.200726
H  -0.28927 -0.256306 1.276571
H  0.289269 -0.25618 -1.276556
H  0.36813 -2.03851 -1.200825
H  -2.965517 1.700091 1.000661
H  -1.256109 1.913467 0.481381
H  2.96526 1.700508 -1.000728
H  1.255846 1.913698 -0.481388
H  -3.981249 -1.210315 1.585507
H  3.981395 -1.209756 -1.58554
H  -2.650982 3.901282 -0.243174
H  -2.046723 2.99882 -1.671739
H  -3.743884 2.8021 -1.147169
H  2.650526 3.90167 0.243104
H  2.046416 2.999152 1.671696
H  3.74358 2.802614 1.147069
