program: Gaussian 09
title: 000216064
version: EM64L-G09RevD.01
frameworkgroup: C1[X(C6H14NO4PS2)]
method: RPBEPBE
basis: SDD
operation: Freq
keyword: #p
keyword: freq=noraman
keyword: PBEPBE/SDD
title: #p freq=noraman PBEPBE/SDD
converged: YES YES NO NO
title: Mulliken charges:
elementType: S S P O O O O N C C C C C C H H H H H H H H H H H H H H
charge: 0.106852 -0.209995 0.572938 -0.449014 -0.508979 -0.264979 -0.259861 -0.358440 -0.810118 0.323085 -0.285428 -0.477641 -0.475426 -0.520976 0.314905 0.288617 0.372870 0.237783 0.225841 0.270749 0.244777 0.231696 0.246747 0.253271 0.233218 0.222335 0.256773 0.218401
chargesum: 0.00000
title: Mulliken charges with hydrogens summed into heavy atoms:
elementType: S S P O O O O N C C C C C C
charge: 0.106852 -0.209995 0.572938 -0.449014 -0.508979 -0.264979 -0.259861 0.014430 -0.206596 0.323085 0.178197 0.269581 0.257810 0.176533
polarizability: 1.83405671e+02 1.70313032e+01 1.42904744e+02 -1.04449957e+00 4.86408198e+00 1.22725109e+02
1716.lowfreq: -32.2377 -3.3300 -0.0017 -0.0016 0.0015 3.0800 13.4998 42.4379 50.6057
frequency: -30.6457 42.2789 50.3906 57.4469 70.7447 75.9918 85.6310 97.1963 101.8963 125.3340 138.8649 143.9625 156.8400 178.0029 195.2587 220.5575 240.6655 254.9737 265.4755 308.7630 366.2654 374.7565 383.6842 419.1146 489.3283 534.1446 572.5028 607.2846 646.7112 675.0873 741.2910 776.1213 840.3201 850.9733 878.4195 944.7432 960.1744 1014.6320 1052.8259 1088.0087 1106.0690 1113.0499 1121.9886 1126.2018 1130.0226 1138.0926 1172.7762 1242.1042 1266.7737 1288.9820 1382.5522 1407.7413 1419.4172 1423.4253 1431.9491 1445.0533 1450.0917 1451.5564 1453.2212 1462.4108 1474.8472 1487.3158 1514.0476 1627.0727 2963.8532 2983.3340 2993.3063 3003.7610 3046.0773 3060.4854 3086.4400 3097.5135 3099.6156 3105.8068 3125.5307 3128.8572 3143.3143 3421.6093
redmass: 1.7432 4.7061 3.7274 2.8636 4.8053 2.1840 3.2699 2.1859 1.8543 4.5874 3.7299 4.2459 2.8808 2.5336 2.0960 6.6457 5.1399 3.9864 7.1334 7.5894 2.9701 3.3730 2.9079 8.5115 4.7219 15.0440 4.4678 11.9959 5.0029 9.3736 6.0998 1.2769 4.5992 2.2418 2.6252 11.5032 10.8168 5.5536 4.1078 1.8863 1.2473 1.2463 1.2861 1.2953 1.2917 1.2226 1.5386 1.1846 2.4031 1.1142 1.1530 1.1235 1.1183 1.1187 1.1133 1.0931 1.0558 1.0495 1.0634 1.0527 1.0532 1.0544 1.6028 5.8624 1.0315 1.0295 1.0292 1.0612 1.0570 1.1029 1.1052 1.1039 1.1061 1.1025 1.1035 1.1074 1.1033 1.0809
irintensity: 1.5194 1.8641 0.9982 2.6470 0.6323 2.7362 2.2530 2.1875 1.3065 1.2549 3.8441 2.4641 8.0750 1.6146 3.8130 16.7708 11.9040 2.2935 9.4910 6.4722 1.0548 3.4957 12.2272 21.5613 17.2841 79.7942 25.2568 95.1547 1.8423 136.5280 5.0348 67.4612 30.9567 12.8304 3.0463 172.1618 108.0703 129.3918 18.1507 22.9776 0.2961 0.3937 3.7878 0.9422 0.0996 40.4978 5.5359 3.8098 56.7756 10.9604 8.4300 28.2346 4.4853 5.3718 9.3494 19.4431 15.3102 17.1785 6.9360 8.1605 14.0571 10.8878 156.2237 201.6235 39.7507 45.2076 33.3817 53.0357 7.1745 30.8792 19.4947 13.0696 24.9877 29.2656 8.0498 4.0445 4.3943 152.9014
temp: 298.150 k
press: 1.00000 atm
elementType: 16 16 15 8 8 8 8 7 6 6 6 6 6 6 1 1 1 1 1 1 1 1 1 1 1 1 1 1
symmnumber: 1
zpe: 552811.9 jmol-1
zpe.correction: 0.210555 hartree
zpe.thermalcorrener: 0.229031 hartree
zpe.thermalcorrenthalpy: 0.229975 hartree
zpe.thermalcorrgfe: 0.162517 hartree
zpe.sumelectzpe: -1728.872211 hartree
zpe.sumelectthermal: -1728.853734 hartree
zpe.sumelectthermalent: -1728.852790 hartree
zpe.sumelectthermalfe: -1728.920249 hartree
dipole: 1.8153 0.7553 4.1462
dipole: 4.5888
quadrupole: -122.9239 -102.8010 -100.9943
quadrupole: -3.5636 4.9894 -6.7654
quadrupole: -14.0175 6.1054 7.9121 -3.5636 4.9894 -6.7654
hfenergy: -1729.0827655 hartree
pointgroup: C01 [X(C6H14N1O4P1S2)]
dipole: 0.462215 -1.4992641 -0.8932594 debye
polarizability: 174.3821325|-18.9438969|144.542246|13.9664922|-14.3548256|130.111145 unknown
InChI: InChI=1S/C4H8NO2S.C2H6O2PS/c1-7-3-5-4(6)2-8;1-3-5(6)4-2/h5H,2-3H2,1H3;1-2H3
charge 0 multiplicity 1
28 atoms
S  1.259448 2.068623 -0.095823
S  3.66634 -0.569993 1.050593
P  1.755294 -0.089831 0.450463
O  0.429724 -0.388117 1.515677
O  1.140568 -1.028892 -0.92207
O  -2.950468 -0.720398 0.916195
O  -2.258159 2.382727 -1.017514
N  -1.626737 0.124957 -0.972169
C  0.057647 1.813821 -1.558815
C  -1.379382 1.478598 -1.147297
C  -2.919327 -0.3749 -0.503608
C  0.339393 -1.712377 2.185845
C  2.102883 -1.609937 -1.885795
C  -2.810768 0.456533 1.795177
H  0.063599 2.801213 -2.048289
H  0.496219 1.055673 -2.225256
H  -0.830023 -0.525472 -1.014813
H  -3.672816 0.402706 -0.734559
H  -3.157814 -1.32117 -1.014444
H  -0.67904 -1.7296 2.598705
H  1.097528 -1.781983 2.984648
H  0.462081 -2.533907 1.458386
H  1.527086 -2.36427 -2.443112
H  2.945886 -2.083043 -1.351413
H  2.485761 -0.833853 -2.572383
H  -3.50255 1.264687 1.486073
H  -1.772191 0.834909 1.783227
H  -3.070683 0.106798 2.807172
