program: Gaussian 09
title: 000210660
version: EM64L-G09RevD.01
frameworkgroup: C1[X(C22H29N3O)]
method: RPBEPBE
basis: SDD
operation: Freq
keyword: #p
keyword: freq=noraman
keyword: PBEPBE/SDD
title: #p freq=noraman PBEPBE/SDD
converged: YES YES NO NO
title: Mulliken charges:
elementType: O N N N C C C C C C C C C C C C C C C C C C C C C C H H H H H H H H H H H H H H H H H H H H H H H H H H H H H
charge: -0.235158 -0.064839 -0.316697 -0.054242 -0.400041 -0.362295 0.112234 -0.378284 -0.400725 -0.414323 -0.402491 0.246273 -0.485397 -0.484719 -0.371528 -0.419959 -0.422870 -0.133729 -0.507124 0.155269 0.403956 -0.335431 -0.375555 -0.230155 -0.207165 -0.244728 0.199405 0.205931 0.213539 0.171805 0.205794 0.193575 0.208913 0.196802 0.200102 0.194443 0.197355 0.196288 0.226938 0.249638 0.215196 0.249831 0.213356 0.206179 0.197413 0.240027 0.211003 0.215448 0.242993 0.256319 0.245051 0.281741 0.229357 0.232420 0.232856
chargesum: 0.00000
title: Mulliken charges with hydrogens summed into heavy atoms:
elementType: O N N N C C C C C C C C C C C C C C C C C C C C C C
charge: -0.235158 -0.064839 -0.316697 -0.054242 0.005295 0.023050 0.112234 0.021086 0.004990 -0.019778 -0.008847 0.246273 -0.008821 -0.019692 0.065911 -0.000424 0.003582 -0.133729 -0.007812 0.155269 0.403956 -0.090380 -0.093814 -0.000797 0.025255 -0.011871
chargesum: 0.00012
polarizability: 3.29055042e+02 -2.77679005e+01 3.01566918e+02 -1.93036144e+01 -6.07295668e+00 1.72319767e+02
1716.lowfreq: -4.1723 -0.8242 -0.0451 -0.0442 2.1668 7.3263 22.0818 23.8036 29.5784
frequency: 21.8391 22.7897 29.5233 42.8440 51.1825 62.0450 70.4803 92.3616 101.9270 117.9521 137.3669 145.1363 164.4896 171.4531 212.4950 234.1706 249.0985 260.4639 293.2976 294.6031 308.5413 311.4846 331.2519 362.1510 385.3584 407.1204 409.5248 420.5301 431.9805 470.6504 476.4940 494.1131 509.9449 514.1471 546.5363 612.5617 620.3203 643.6280 660.7523 674.9269 690.9632 696.0577 702.3296 730.1353 767.0069 776.7914 785.6427 806.8052 816.5144 826.2765 836.7732 840.9397 852.8627 856.1101 905.9627 915.8824 934.9269 945.3989 953.9815 966.7672 972.9037 975.5729 980.3826 988.7943 989.1152 993.9800 1020.8268 1025.4720 1046.6321 1065.4579 1074.9109 1079.4581 1083.5289 1087.7507 1105.1217 1112.4894 1117.6086 1124.8180 1136.1322 1139.2621 1150.0990 1173.2790 1176.2458 1186.1284 1193.6628 1199.7140 1208.0656 1236.5826 1239.5385 1241.3474 1257.2492 1263.0485 1274.8760 1287.5586 1303.9037 1310.1313 1317.4640 1324.6690 1329.8628 1331.2121 1336.9031 1338.1000 1343.4915 1344.3730 1348.7756 1354.5429 1360.5043 1364.4290 1386.8929 1403.5241 1409.2771 1429.7387 1446.2473 1453.3724 1454.1491 1456.3917 1460.5451 1462.4827 1465.5769 1468.4467 1471.4576 1473.4029 1481.2828 1482.6987 1491.5097 1495.3908 1563.0600 1579.2308 1598.5566 1612.2329 2841.0263 2876.8921 2954.6316 2959.2390 2959.7177 2961.4656 2967.2915 2971.8033 2980.3064 2985.3808 2987.7708 2988.3724 2990.2038 3012.4311 3018.0069 3025.2143 3028.0492 3031.6480 3036.5958 3043.8003 3045.6950 3049.5203 3051.4475 3057.1408 3133.1548 3144.5010 3162.8939 3181.0374 3185.9486
redmass: 4.5280 3.2878 4.2682 3.6665 4.1523 4.5396 3.4317 2.8491 3.1661 3.3055 3.9252 2.9141 2.4660 2.8418 4.4170 4.9546 1.8977 3.7168 5.6641 2.7416 2.0900 2.3557 2.6685 4.3155 2.6167 3.6052 3.9114 2.9360 2.8011 3.6641 2.2482 1.6609 3.1100 2.3873 2.9400 6.3233 6.2044 4.3989 4.2884 3.8801 3.2717 2.0707 3.9985 3.8352 1.7376 1.8722 2.6360 1.4392 2.8310 1.6193 2.3375 1.2570 2.3513 1.5669 1.4569 1.4151 3.0849 2.3738 2.2343 2.7242 1.4468 2.8451 1.7158 5.8431 2.3022 1.3281 2.1134 2.1873 2.5169 2.6925 2.3255 1.8722 2.0751 1.9641 2.7805 2.1260 2.2944 1.6447 1.1736 1.7487 1.6808 1.0528 1.4694 1.1275 1.7362 1.4976 1.8053 1.4162 1.4000 1.5454 1.3590 1.4361 1.1856 1.4150 1.3108 1.3825 1.7143 1.4375 1.3682 1.6569 1.9556 1.3983 1.3099 1.6808 1.9363 1.4429 1.3656 1.4980 9.6776 1.5109 3.4522 1.1730 2.1818 1.1922 1.0846 1.0876 1.1057 1.0809 1.0956 1.1857 1.0900 1.0981 1.6996 1.6725 3.1038 1.0863 6.5449 7.6550 6.8463 6.1643 1.0721 1.0712 1.0593 1.0640 1.0639 1.0686 1.0619 1.0730 1.0662 1.0655 1.0621 1.0774 1.0623 1.0946 1.1007 1.0948 1.1017 1.0898 1.0994 1.0952 1.0935 1.0995 1.0935 1.1026 1.0854 1.0904 1.0961 1.0942 1.0971
irintensity: 0.9949 0.2083 0.1659 0.6003 1.1534 0.8182 1.9021 1.4462 0.1637 0.5761 2.0776 1.5914 2.2679 4.1793 1.1064 2.1416 1.6155 4.8513 2.7600 2.6005 0.8862 4.0820 3.4105 0.8694 3.5473 0.3758 0.5958 3.5598 11.0809 7.7656 0.3228 4.5022 2.3095 2.0980 2.1332 0.0655 10.1143 10.6905 2.6028 5.5901 11.4101 35.1607 2.3174 16.7825 63.8378 2.5234 2.8731 3.5948 22.2605 1.3248 15.4827 1.6298 11.5561 0.5364 2.8864 5.2746 41.0335 17.7968 5.2855 26.8318 4.1006 4.2605 3.0588 0.0666 11.7244 0.3563 15.6883 6.0568 17.1079 43.7190 8.9175 0.0988 2.3452 34.6449 48.0565 24.1394 31.3198 9.9294 0.3003 17.7656 5.1697 0.0562 7.6445 1.1011 2.1593 1.8519 11.3653 2.5819 2.8445 3.9678 9.8477 22.1376 1.5830 7.9193 11.0576 12.9062 17.1126 4.5805 7.3016 2.3313 62.5220 0.0011 1.2596 13.0912 62.4703 1.6841 6.2609 67.5050 0.1105 1.6399 64.9642 21.5230 3.6362 4.0982 13.0647 6.6018 21.1780 6.6333 9.3115 25.7291 7.6778 6.4797 27.1134 67.4144 69.8127 9.2332 82.2924 96.7736 5.9618 41.8221 81.7887 69.8156 28.5801 32.7428 32.4334 30.7427 28.5970 18.2527 35.3114 17.4550 30.2530 80.0212 26.7407 76.0440 50.0720 20.3070 49.1121 1.0403 105.9475 37.2590 39.5164 39.0924 32.2593 54.4103 0.5274 14.6414 33.7789 9.0574 2.6313
temp: 298.150 k
press: 1.00000 atm
elementType: 8 7 7 7 6 6 6 6 6 6 6 6 6 6 6 6 6 6 6 6 6 6 6 6 6 6 1 1 1 1 1 1 1 1 1 1 1 1 1 1 1 1 1 1 1 1 1 1 1 1 1 1 1 1 1
symmnumber: 1
zpe: 1232562.1 jmol-1
zpe.correction: 0.469458 hartree
zpe.thermalcorrener: 0.493456 hartree
zpe.thermalcorrenthalpy: 0.494401 hartree
zpe.thermalcorrgfe: 0.413610 hartree
zpe.sumelectzpe: -1093.254210 hartree
zpe.sumelectthermal: -1093.230212 hartree
zpe.sumelectthermalent: -1093.229268 hartree
zpe.sumelectthermalfe: -1093.310058 hartree
dipole: -3.6635 1.6458 0.6614
dipole: 4.0702
quadrupole: -127.2593 -151.7535 -155.9306
quadrupole: 2.5545 -2.6152 -1.3787
quadrupole: 17.7219 -6.7724 -10.9495 2.5545 -2.6152 -1.3787
hfenergy: -1093.7236685 hartree
pointgroup: C01 [X(C22H29N3O1)]
dipole: -1.451689 -0.6300497 -0.2449184 debye
polarizability: 329.8003478|28.1725531|299.599205|19.3679377|-12.0955219|173.542174 unknown
InChI: InChI=1S/C22H29N3O/c26-21(14-17-24-15-8-1-2-9-16-24)22-19-12-6-7-13-20(19)25(23-22)18-10-4-3-5-11-18/h3-5,10-11H,1-2,6-9,12-17H2
charge 0 multiplicity 1
55 atoms
O  0.924985 2.688118 0.053222
N  4.107207 -0.13739 0.608965
N  -2.54316 -0.284388 -0.011091
N  -1.158288 -0.279753 0.123231
C  4.296008 -1.200954 -0.410452
C  5.341911 0.50082 1.144018
C  -1.960353 1.884502 -0.152878
C  5.339336 -0.93331 -1.538507
C  6.565781 -0.432408 1.288497
C  6.767304 -1.38287 -1.145276
C  7.415261 -0.56724 -0.001419
C  -3.058541 1.014974 -0.172512
C  -2.084176 3.381991 -0.2833
C  -4.500663 1.443954 -0.264398
C  3.102666 0.891982 0.241329
C  -3.521527 3.771234 -0.71892
C  -4.593129 2.962008 0.053297
C  -0.806679 1.046384 0.033032
C  1.659865 0.362451 0.315605
C  0.61352 1.457385 0.123469
C  -3.228649 -1.541672 0.080081
C  -4.466291 -1.75143 -0.576385
C  -2.63034 -2.590257 0.822995
C  -5.112362 -3.00199 -0.464485
C  -3.281448 -3.836138 0.919534
C  -4.528051 -4.048313 0.283753
H  3.305119 -1.390105 -0.861942
H  4.579408 -2.144556 0.099176
H  5.082301 0.919694 2.13733
H  5.657763 1.371449 0.512126
H  5.331685 0.141264 -1.814509
H  5.032714 -1.491858 -2.44581
H  6.243212 -1.426214 1.656793
H  7.213754 -0.005268 2.079411
H  7.430958 -1.334575 -2.032306
H  6.720551 -2.45189 -0.847828
H  8.388736 -1.033886 0.252014
H  7.645712 0.454809 -0.368517
H  -1.833605 3.858043 0.68562
H  -1.332262 3.765788 -0.995619
H  -4.899739 1.265438 -1.284328
H  -5.136656 0.864739 0.432039
H  -3.677204 4.854181 -0.557795
H  -3.644016 3.585895 -1.805236
H  3.290052 1.334321 -0.768324
H  3.197337 1.730601 0.954636
H  -5.606539 3.32354 -0.203277
H  -4.455168 3.117997 1.141298
H  1.464284 -0.44023 -0.420318
H  1.497289 -0.113633 1.303572
H  -4.909713 -0.967029 -1.194215
H  -1.664973 -2.412273 1.302745
H  -6.067604 -3.159937 -0.976901
H  -2.815659 -4.642386 1.496474
H  -5.032127 -5.017111 0.364983
