program: Gaussian 09
title: 000216050
version: EM64L-G09RevD.01
frameworkgroup: C1[X(C10H19NO)]
method: RPBEPBE
basis: SDD
operation: Freq
keyword: #p
keyword: freq=noraman
keyword: PBEPBE/SDD
title: #p freq=noraman PBEPBE/SDD
converged: YES YES NO NO
title: Mulliken charges:
elementType: O N C C C C C C C C C C H H H H H H H H H H H H H H H H H H H
charge: -0.450273 -0.109312 -0.355456 -0.458129 0.165492 -0.317554 -0.322231 -0.723362 -0.679256 -0.676891 0.245728 -0.527742 0.214837 0.219418 0.203830 0.217303 0.187800 0.204543 0.188416 0.201066 0.224740 0.204034 0.248613 0.225008 0.208199 0.205481 0.223921 0.212286 0.206799 0.331744 0.280950
chargesum: 0.00000
title: Mulliken charges with hydrogens summed into heavy atoms:
elementType: O N C C C C C C C C C C
charge: -0.118529 -0.109312 0.078798 -0.036995 0.165492 0.074789 0.067251 -0.045976 -0.040568 -0.033886 0.245728 -0.246792
polarizability: 1.26392156e+02 5.30831551e+00 1.13390489e+02 -6.59683120e+00 -8.11055798e+00 1.13679973e+02
1716.lowfreq: -10.8756 -5.9745 -2.8082 -0.0008 -0.0002 0.0003 23.0282 45.9254 60.2395
frequency: 22.1697 45.8864 60.2190 80.2184 100.9252 124.5950 163.6839 176.5049 199.7333 205.8813 236.7028 246.7620 256.7925 289.3299 293.1795 326.5284 393.4211 397.9323 423.7874 445.9565 478.5552 543.5930 580.8626 631.2824 668.6988 703.4221 754.5330 781.7065 794.1574 797.4279 865.7976 905.8721 927.0054 980.4135 1012.2660 1037.5348 1071.8490 1074.4136 1076.9825 1084.3058 1094.0474 1114.9025 1152.7272 1165.3347 1203.7577 1221.6198 1276.5879 1286.4475 1292.1660 1303.3998 1339.6440 1361.6326 1366.3060 1376.7700 1382.5901 1385.6440 1386.9299 1451.4866 1461.6390 1462.7825 1464.6289 1469.1091 1470.1530 1477.2532 1485.5773 1486.8738 1491.0197 2142.3020 2849.5018 2858.3780 2894.4251 2979.5814 2981.9553 2983.0696 2983.9821 3025.8738 3031.8701 3037.0052 3062.9262 3074.9735 3076.1869 3079.0151 3089.9143 3090.3773 3106.3719 3429.8175 3531.0706
redmass: 3.7253 3.4948 2.5401 1.9861 3.0306 2.4518 1.9488 3.3605 1.4407 1.8928 1.0755 1.6351 1.1163 1.9310 2.2168 2.5986 3.5383 3.2156 3.0497 2.9000 2.7538 5.7385 4.6420 1.2202 1.2535 4.1927 2.5591 1.2948 1.1324 1.2564 2.4946 1.9555 1.7477 2.4266 1.5013 2.9887 2.2611 2.3087 1.7617 2.1224 2.4056 1.6634 1.7416 2.3027 2.2909 1.7475 1.1504 1.2545 1.2093 1.4168 1.7146 1.3288 1.3305 1.2986 1.2461 1.2684 1.2441 1.0748 1.0508 1.0539 1.0513 1.0678 1.0596 1.0583 1.0751 1.0630 1.0730 6.0345 1.0721 1.0716 1.0708 1.0471 1.0354 1.0359 1.0488 1.0870 1.0873 1.0965 1.0931 1.0982 1.0978 1.0979 1.1004 1.1002 1.1004 1.1596 1.0655
irintensity: 0.7156 0.1212 0.3897 0.3562 0.1044 3.7633 1.7177 2.6888 0.5165 3.3790 18.8366 7.8699 136.9990 2.2267 12.8620 0.4420 8.4299 6.1757 3.0574 1.6670 5.7780 3.0738 6.9313 82.8666 58.2059 8.2795 9.6947 0.2127 6.0208 5.2519 48.4994 0.0323 5.6114 4.4980 14.1002 11.2250 13.4453 22.6927 6.3336 1.6718 32.0627 80.9473 38.3188 35.2122 18.0753 12.4968 1.6732 13.2092 23.3477 22.9816 33.0249 3.1325 6.9141 11.5742 20.7747 6.3480 19.7840 1.6841 6.8947 5.6010 3.2277 6.3394 2.3321 2.9454 14.0639 12.9478 12.3144 0.7107 31.9461 146.2532 83.5305 1.6790 35.1455 28.1139 47.2339 14.7070 22.8142 8.5271 23.7415 33.4182 81.3055 38.7595 37.8062 49.5799 21.2553 58.8647 7.3382
temp: 298.150 k
press: 1.00000 atm
elementType: 8 7 6 6 6 6 6 6 6 6 6 6 1 1 1 1 1 1 1 1 1 1 1 1 1 1 1 1 1 1 1
symmnumber: 1
zpe: 705799.8 jmol-1
zpe.correction: 0.268825 hartree
zpe.thermalcorrener: 0.284622 hartree
zpe.thermalcorrenthalpy: 0.285566 hartree
zpe.thermalcorrgfe: 0.225385 hartree
zpe.sumelectzpe: -521.357533 hartree
zpe.sumelectthermal: -521.341736 hartree
zpe.sumelectthermalent: -521.340792 hartree
zpe.sumelectthermalfe: -521.400973 hartree
dipole: 0.8071 -1.0348 -1.1650
dipole: 1.7548
quadrupole: -77.2691 -74.0750 -71.7094
quadrupole: 3.8363 4.9319 -4.6633
quadrupole: -2.9180 0.2762 2.6417 3.8363 4.9319 -4.6633
hfenergy: -521.6263579 hartree
pointgroup: C01 [X(C10H19N1O1)]
dipole: -0.3199839 -0.4998639 0.3526834 debye
polarizability: 126.7979533|-3.7387013|109.9040016|-7.453968|7.1319498|116.7606631 unknown
InChI: InChI=1S/C10H19NO/c1-5-10(4,12)8-9-11(6-2)7-3/h1,12H,6-9H2,2-4H3
charge 0 multiplicity 1
31 atoms
O  2.168736 1.551937 0.540871
N  -1.796973 -0.073581 -0.050728
C  -0.379997 0.239537 -0.379194
C  0.593472 -0.376342 0.646073
C  2.074057 0.06202 0.447336
C  -2.200089 -1.426971 -0.523066
C  -2.737614 0.990077 -0.498386
C  2.988411 -0.575607 1.525109
C  -3.375791 -2.020488 0.27716
C  -2.695346 2.244264 0.395542
C  2.571687 -0.284899 -0.902831
C  3.011677 -0.624989 -2.001796
H  -0.107659 -0.100405 -1.407397
H  -0.242182 1.334613 -0.365645
H  0.543621 -1.481921 0.610973
H  0.269552 -0.072061 1.661802
H  -2.451227 -1.417993 -1.614795
H  -1.32727 -2.097173 -0.413283
H  -2.549456 1.278695 -1.564145
H  -3.75989 0.571125 -0.464099
H  3.016314 -1.674718 1.425073
H  2.610499 -0.330955 2.536251
H  4.014733 -0.185579 1.42361
H  -3.1123 -2.085144 1.347302
H  -4.288051 -1.402836 0.189937
H  -3.622429 -3.034196 -0.090842
H  -2.930324 1.973194 1.43972
H  -1.701065 2.726366 0.381982
H  -3.432801 2.991748 0.047611
H  1.870848 1.8041 1.454519
H  3.390154 -0.906121 -2.967162
