program: Gaussian 09
title: 000210658
version: EM64L-G09RevD.01
frameworkgroup: C1[X(C21H27N3O)]
method: RPBEPBE
basis: SDD
operation: Freq
keyword: #p
keyword: freq=noraman
keyword: PBEPBE/SDD
title: #p freq=noraman PBEPBE/SDD
converged: YES YES NO NO
title: Mulliken charges:
elementType: O N N N C C C C C C C C C C C C C C C C C C C C C H H H H H H H H H H H H H H H H H H H H H H H H H H H
charge: -0.228225 -0.064304 -0.280006 -0.069622 -0.400144 -0.362996 0.103135 0.207765 -0.378343 -0.400811 -0.502540 -0.497863 -0.414588 -0.403454 -0.453063 -0.371869 -0.098975 -0.508893 0.152827 0.410169 -0.346113 -0.387958 -0.230376 -0.203653 -0.244450 0.198117 0.206499 0.213799 0.172039 0.206165 0.193823 0.209279 0.197276 0.249795 0.233520 0.232750 0.242728 0.200372 0.194569 0.197652 0.196600 0.232181 0.223538 0.199253 0.238904 0.241613 0.258566 0.252000 0.290527 0.228100 0.232113 0.232574
chargesum: 0.00000
title: Mulliken charges with hydrogens summed into heavy atoms:
elementType: O N N N C C C C C C C C C C C C C C C C C C C C C
charge: -0.228225 -0.064304 -0.280006 -0.069622 0.004472 0.022841 0.103135 0.207765 0.021645 0.005744 -0.019225 -0.022385 -0.019647 -0.009203 0.002655 0.066288 -0.098975 -0.008713 0.152827 0.410169 -0.094113 -0.097431 -0.002276 0.028461 -0.011877
polarizability: 3.28836031e+02 -2.69343176e+01 2.88953666e+02 -1.27116383e+01 -6.33802999e+00 1.55947240e+02
1716.lowfreq: -6.2959 -0.5624 -0.0006 0.0000 0.0006 4.5325 21.0538 23.2721 29.3705
frequency: 20.6342 22.1557 29.0824 32.4891 51.6781 62.7753 72.8684 96.3324 117.9193 125.5741 144.8997 146.3120 165.9098 174.1941 208.3871 235.6810 246.6608 253.0917 291.3768 301.0417 310.0888 331.5402 350.5378 390.6310 406.1642 423.5488 433.6988 441.4527 495.2592 506.7076 514.2914 540.4918 581.8960 613.8805 628.2217 641.2038 663.9611 684.1021 689.6922 694.7047 717.2304 739.8564 768.6834 781.1316 800.4254 808.0555 823.2945 827.6068 839.9260 842.1002 857.3115 895.1318 897.3782 919.6161 942.6203 954.9352 971.8649 976.6587 981.6768 987.9074 991.3040 997.9228 1001.4976 1019.2444 1021.7763 1040.3424 1044.6873 1058.0629 1063.4191 1085.3738 1088.2941 1102.5944 1116.4481 1123.8335 1137.1521 1138.5351 1172.6986 1175.4265 1183.0834 1188.5591 1191.0810 1197.1462 1202.2985 1213.4094 1239.1964 1249.2676 1259.4941 1273.1528 1275.8985 1285.9497 1298.8785 1303.0259 1310.3546 1313.5286 1324.5172 1330.6438 1337.2646 1341.3951 1344.1170 1354.7557 1361.2237 1363.7300 1388.0647 1402.1877 1422.0099 1429.8017 1451.2468 1454.3955 1458.8372 1460.8246 1463.4623 1466.1169 1467.8036 1471.7710 1479.7572 1483.8230 1494.0146 1494.7120 1509.1949 1552.5263 1578.3815 1599.8814 1613.0420 2841.8050 2878.5875 2954.6280 2960.0899 2963.6658 2967.9570 2972.8278 2973.1150 2989.4316 2989.7597 2995.9047 3012.5431 3013.4309 3018.2989 3028.5844 3029.7849 3036.8917 3039.7425 3043.5847 3050.1547 3064.3457 3084.7239 3133.4535 3144.3489 3163.4918 3180.9179 3188.1982
redmass: 4.0561 3.6488 4.0915 3.6734 3.9988 5.1944 3.7433 2.6114 2.8465 3.3086 3.9633 2.0699 2.5455 2.8713 3.7391 4.9589 2.0615 3.3383 7.1501 3.6789 2.1183 3.9479 4.1172 2.4741 2.8822 3.0151 3.7775 3.4685 1.5467 3.2675 2.3146 2.7236 3.5528 6.0445 6.4484 5.5306 5.6171 3.4505 3.7300 1.9667 2.2173 3.8617 1.7365 1.6348 3.8026 1.4345 2.7656 2.5575 2.0283 1.5334 1.5879 1.6257 2.2171 1.4254 2.3812 2.2340 3.1219 1.3743 1.7844 5.9967 2.4471 1.3213 2.9852 2.3254 2.3040 1.9086 2.3798 2.4139 2.7751 2.4656 2.0719 1.9944 2.3155 1.6391 1.2295 1.7017 1.0558 1.4823 1.2147 1.3430 1.3778 1.3241 1.4188 1.9566 1.4007 1.9993 1.2220 1.2510 1.2335 1.5872 2.0087 1.3289 1.5985 1.6452 1.3800 1.3642 1.4117 2.0798 1.7499 1.4401 1.3743 1.5406 9.7426 1.4326 2.7400 1.2897 2.4909 1.0852 1.0858 1.1303 1.0804 1.0893 1.0840 1.0897 1.1558 1.0811 2.6977 1.1040 9.4167 6.2733 8.3754 6.8960 6.1361 1.0718 1.0713 1.0596 1.0638 1.0680 1.0618 1.0639 1.0721 1.0686 1.0716 1.0666 1.0943 1.0655 1.1006 1.1013 1.0914 1.0991 1.0951 1.0957 1.0932 1.0957 1.1043 1.0854 1.0905 1.0961 1.0946 1.0962
irintensity: 0.7949 0.3168 0.1276 0.6670 0.9278 1.4101 2.5528 1.2655 0.3006 1.0873 3.1508 1.2590 2.6816 4.3958 0.4011 4.5325 1.5277 1.8911 5.3862 1.1552 1.4297 3.0600 0.7377 2.8542 0.0976 2.3089 5.4811 13.1562 2.4013 6.0948 1.2213 1.8855 6.6444 0.2088 9.9806 8.3397 7.2399 8.6111 4.0460 39.9814 4.7304 19.6177 65.4853 3.3182 4.2385 5.6743 9.3408 3.4601 10.1263 8.0442 0.3902 1.3205 5.9822 4.8375 54.1242 5.2850 40.3619 0.9546 1.3222 0.1868 21.9613 0.7623 2.0569 29.5066 3.9336 10.7659 12.4123 27.6749 22.5064 18.9832 17.0684 36.2783 14.1983 10.9137 8.1778 15.6707 0.1042 8.4171 2.6309 1.9795 9.0818 4.8223 0.3207 23.2984 3.9525 4.6979 19.5024 4.7449 2.4055 7.5520 9.0979 8.3429 20.4443 11.1683 3.4932 6.0714 0.2857 71.9815 72.5739 4.4258 9.0248 89.0189 1.0019 4.3192 38.7107 25.4921 4.2783 9.2749 10.4576 4.4311 6.3748 11.1461 9.0999 9.8674 4.1470 13.0244 114.0542 22.1617 41.6390 28.8886 143.6235 4.8252 49.6262 83.3293 66.8132 30.5215 34.1122 27.6646 28.5013 35.0518 16.3630 41.1456 62.6422 27.1100 80.4248 37.9474 50.6539 47.3954 2.6038 104.4157 21.4281 37.4648 35.5822 14.4112 43.2797 0.6617 15.7369 33.1798 8.0049 3.0814
temp: 298.150 k
press: 1.00000 atm
elementType: 8 7 7 7 6 6 6 6 6 6 6 6 6 6 6 6 6 6 6 6 6 6 6 6 6 1 1 1 1 1 1 1 1 1 1 1 1 1 1 1 1 1 1 1 1 1 1 1 1 1 1 1
symmnumber: 1
zpe: 1157131.3 jmol-1
zpe.correction: 0.440728 hartree
zpe.thermalcorrener: 0.463807 hartree
zpe.thermalcorrenthalpy: 0.464751 hartree
zpe.thermalcorrgfe: 0.385406 hartree
zpe.sumelectzpe: -1054.016235 hartree
zpe.sumelectthermal: -1053.993156 hartree
zpe.sumelectthermalent: -1053.992212 hartree
zpe.sumelectthermalfe: -1054.071557 hartree
dipole: -3.6187 1.4377 0.6933
dipole: 3.9550
quadrupole: -118.4357 -145.5989 -151.2446
quadrupole: 5.3436 -1.9843 -0.7873
quadrupole: 19.9907 -7.1725 -12.8182 5.3436 -1.9843 -0.7873
hfenergy: -1054.4569628 hartree
pointgroup: C01 [X(C21H27N3O1)]
dipole: 1.4386132 -0.5405373 0.243829 debye
polarizability: 330.2830907|-26.5524301|285.9677089|11.5314026|15.1489592|157.4861363 unknown
InChI: InChI=1S/C21H27N3O/c25-20(13-16-23-14-6-1-2-7-15-23)21-18-11-8-12-19(18)24(22-21)17-9-4-3-5-10-17/h3-5,9-10H,1-2,6-8,11-16H2
charge 0 multiplicity 1
52 atoms
O  -0.929619 2.757706 0.127477
N  -3.961148 -0.204088 -0.599567
N  2.712603 -0.013812 0.003145
N  1.320498 -0.084733 -0.114541
C  -4.111854 -1.28946 0.403737
C  -5.219886 0.378032 -1.142772
C  1.989311 2.100271 0.236462
C  3.128514 1.30196 0.208759
C  -5.188281 -1.08996 1.514637
C  -6.385628 -0.620002 -1.329007
C  2.333972 3.545296 0.491562
C  4.408561 2.071533 0.424938
C  -6.582494 -1.611569 1.089271
C  -7.252664 -0.820902 -0.05947
C  3.893758 3.5552 0.268756
C  -3.015928 0.868303 -0.198412
C  0.882349 1.215844 0.036917
C  -1.546911 0.417663 -0.279845
C  -0.559762 1.55176 -0.023026
C  3.483776 -1.215217 -0.117407
C  4.856035 -1.226545 0.234438
C  2.857156 -2.396051 -0.586712
C  5.599758 -2.418603 0.101834
C  3.611435 -3.579996 -0.709904
C  4.985358 -3.599969 -0.371065
H  -3.120656 -1.431215 0.871922
H  -4.336048 -2.240205 -0.121822
H  -4.966814 0.833144 -2.121579
H  -5.595459 1.214111 -0.497483
H  -5.242582 -0.019498 1.801165
H  -4.869351 -1.641289 2.422062
H  -5.998811 -1.588208 -1.703405
H  -7.040108 -0.218843 -2.128053
H  1.808203 4.243054 -0.181374
H  2.063567 3.839407 1.52407
H  4.822934 1.89361 1.437897
H  5.205187 1.837835 -0.304351
H  -7.264321 -1.60841 1.963727
H  -6.471725 -2.673449 0.783458
H  -8.191654 -1.340442 -0.338892
H  -7.550573 0.181137 0.314292
H  4.107492 3.89611 -0.760377
H  4.411905 4.240973 0.961062
H  -3.230823 1.270759 0.822032
H  -3.152645 1.720324 -0.888669
H  -1.319356 -0.407589 0.42196
H  -1.34917 -0.004957 -1.285462
H  5.341906 -0.327624 0.621366
H  1.795911 -2.363422 -0.842861
H  6.660274 -2.422795 0.376345
H  3.123854 -4.490403 -1.075071
H  5.566455 -4.522681 -0.471164
