program: Gaussian 09
title: 000216082
version: EM64L-G09RevD.01
frameworkgroup: C1[X(C18H25NO2)]
method: RPBEPBE
basis: SDD
operation: Freq
keyword: #p
keyword: freq=noraman
keyword: PBEPBE/SDD
title: #p freq=noraman PBEPBE/SDD
converged: YES YES NO NO
title: Mulliken charges:
elementType: O O N C C C C C C C C C C C C C C C C C C H H H H H H H H H H H H H H H H H H H H H H H H H
charge: -0.307704 -0.232672 -0.071069 -0.126668 -0.272969 -0.175831 0.238173 -0.547961 -0.481590 -0.469528 -0.459321 0.390246 -0.390344 -0.371791 0.290762 -0.616508 -0.631946 -0.247774 -0.241317 -0.242627 -0.766907 0.245214 0.285999 0.256729 0.244761 0.227387 0.221569 0.217064 0.224107 0.217408 0.238121 0.191478 0.242164 0.239307 0.224853 0.186550 0.220681 0.218356 0.188576 0.234611 0.224355 0.222526 0.227553 0.248233 0.242650 0.245095
chargesum: 0.00000
title: Mulliken charges with hydrogens summed into heavy atoms:
elementType: O O N C C C C C C C C C C C C C C C C C C
charge: -0.307704 -0.232672 -0.071069 0.118545 0.013030 0.080898 0.238173 -0.075813 -0.042956 -0.028014 -0.029722 0.390246 -0.148180 -0.132484 0.290762 0.015576 0.009598 -0.023419 -0.018791 -0.015074 -0.030929
polarizability: 2.17949438e+02 -1.55096857e+01 1.88022557e+02 -1.00347267e+01 -9.16014148e+00 1.83269848e+02
1716.lowfreq: -15.5751 -3.8362 0.0002 0.0004 0.0007 4.9519 23.0834 43.4920 48.2144
frequency: 21.7700 43.3036 48.1675 59.1057 64.9017 76.8655 82.6172 85.7322 122.4010 134.5213 166.0035 204.5137 234.0733 241.1001 247.3214 265.7947 280.8995 287.1789 305.8275 334.2373 348.3759 373.2769 398.5269 419.6371 450.0994 481.3382 507.3101 521.4644 561.6317 568.4119 601.7651 615.8219 660.4192 688.9792 703.1875 739.5197 764.4614 780.4047 796.0305 808.7937 830.0761 850.5910 875.5038 885.8958 894.6022 916.4586 922.3902 925.7257 952.3707 968.8849 976.1589 978.1974 990.6130 992.7966 994.2629 1005.6820 1027.4177 1033.2234 1035.0194 1038.0436 1041.3408 1049.3200 1077.6024 1086.9866 1088.8175 1115.5921 1130.1047 1135.8704 1152.6780 1167.4126 1172.7727 1180.7140 1190.3035 1194.0208 1204.9735 1211.4784 1230.0509 1256.6926 1264.3818 1266.4614 1271.8381 1290.3836 1303.7235 1309.0162 1322.6610 1333.2754 1343.0002 1368.8694 1377.4629 1378.2070 1419.3935 1433.7556 1442.0676 1452.1541 1454.5932 1456.8532 1463.2217 1468.0105 1472.6240 1478.8143 1479.6246 1483.3561 1486.2307 1495.0210 1589.3359 1612.3969 1645.7300 2836.0889 2841.9253 2859.9351 3001.6924 3002.7809 3005.5325 3009.3875 3015.8291 3022.1016 3025.7156 3052.7971 3064.7119 3074.8915 3075.4568 3079.6780 3081.5710 3088.5427 3094.2514 3106.6568 3119.8053 3128.4609 3138.0312 3141.1131 3154.3584 3166.5265
redmass: 3.6379 3.1013 3.0983 1.7493 2.2052 3.1763 3.1151 3.6530 3.3285 3.2091 3.6729 3.8198 1.2661 3.9256 1.1781 3.9777 2.2493 3.7777 3.1710 3.5008 2.9791 1.9571 2.8226 2.3880 2.0453 3.0587 3.4045 3.4874 3.2017 3.3060 5.3382 6.3866 4.2210 5.4582 1.6562 3.5006 2.3186 3.9414 1.4426 4.3254 2.4629 1.2654 3.6642 3.9340 2.5149 1.7532 2.1574 2.4743 2.0612 1.7341 1.4047 2.1609 5.1306 1.8329 1.3421 2.3487 2.0797 2.1430 1.6291 1.6771 2.1849 1.9739 1.5548 1.5428 1.2910 2.1807 1.3227 1.1969 1.9450 1.7014 1.0865 2.0405 1.5796 1.4361 3.3344 1.9050 1.3175 2.3334 1.3772 1.7790 1.6644 1.5145 1.4505 1.5927 1.3897 1.3908 1.3936 1.3672 4.1626 1.4087 1.1444 2.2362 1.1490 1.0625 1.0519 1.0767 1.0697 1.0785 1.0637 1.0685 1.0655 2.2046 1.0553 1.0929 6.0079 6.0068 9.7693 1.0694 1.0574 1.0588 1.0820 1.0375 1.0630 1.0601 1.0721 1.0643 1.0715 1.0879 1.0993 1.1020 1.1038 1.0898 1.1004 1.1020 1.0956 1.0901 1.0848 1.0877 1.1016 1.0935 1.0956 1.0996
irintensity: 0.0592 0.2183 0.1154 2.0171 0.6621 1.0554 2.9431 0.0172 1.4538 1.5031 2.2770 1.3783 1.0662 0.3324 0.5341 1.1732 4.0608 1.4356 0.1582 4.0281 6.1603 1.6125 0.1033 0.6704 0.1722 2.1662 1.2494 13.6680 10.3462 3.4073 9.3898 1.0903 4.7625 5.6520 57.4846 7.0879 34.5835 3.8599 2.4588 10.0220 9.5362 0.5570 7.0063 46.6857 5.1426 4.5584 24.4403 0.3255 22.4106 15.5363 3.3162 35.4144 0.7529 45.3196 1.7713 15.9770 14.7074 37.0209 19.2283 8.2788 3.2255 6.5359 3.2268 11.9404 3.8668 4.6266 10.2695 4.2043 2.2411 29.4007 2.1750 37.2026 6.8090 46.7904 207.6668 16.5169 8.4541 11.2634 1.4525 8.1615 3.8565 1.7769 11.9347 2.7566 0.8939 9.0155 5.7175 6.1756 8.3596 46.2447 3.1646 8.2583 2.3805 16.7602 15.6371 9.6744 14.5299 12.6760 3.1222 11.6674 24.4975 15.0262 20.5269 10.7989 1.9816 3.9335 153.9031 70.4829 68.4566 225.0489 17.7129 3.7719 26.3673 36.8932 41.4950 66.9073 42.8524 20.1220 7.3819 13.6942 50.8850 49.7335 56.4984 55.3740 9.3897 11.6223 2.2298 2.0263 10.7249 25.8841 36.6112 14.7162
temp: 298.150 k
press: 1.00000 atm
elementType: 8 8 7 6 6 6 6 6 6 6 6 6 6 6 6 6 6 6 6 6 6 1 1 1 1 1 1 1 1 1 1 1 1 1 1 1 1 1 1 1 1 1 1 1 1 1
symmnumber: 1
zpe: 1030144.7 jmol-1
zpe.correction: 0.392361 hartree
zpe.thermalcorrener: 0.413060 hartree
zpe.thermalcorrenthalpy: 0.414004 hartree
zpe.thermalcorrgfe: 0.342049 hartree
zpe.sumelectzpe: -904.496111 hartree
zpe.sumelectthermal: -904.475413 hartree
zpe.sumelectthermalent: -904.474469 hartree
zpe.sumelectthermalfe: -904.546424 hartree
dipole: -1.5747 -1.3469 0.9718
dipole: 2.2887
quadrupole: -128.3895 -124.4086 -116.6297
quadrupole: -6.0292 -3.8696 -0.5194
quadrupole: -5.2469 -1.2660 6.5129 -6.0292 -3.8696 -0.5194
hfenergy: -904.8884728 hartree
pointgroup: C01 [X(C18H25N1O2)]
dipole: -0.5943218 -0.5554009 0.3861347 debye
polarizability: 217.6863627|-14.8910318|188.0868185|-11.7495241|-8.6093919|183.4686613 unknown
InChI: InChI=1S/C18H25NO2/c1-13(20)21-18(15-7-5-4-6-8-15)16-10-9-14(11-16)17(18)12-19(2)3/h4-8,14,16-17H,9-12H2,1-3H3
charge 0 multiplicity 1
46 atoms
O  0.138975 1.027959 1.144642
O  2.055882 2.327069 0.779873
N  -3.312482 -1.2446 0.514577
C  -1.814656 0.30913 -1.660065
C  0.130358 1.479761 -1.377498
C  -1.144296 -0.411342 -0.446613
C  0.210284 0.410365 -0.239497
C  -0.560118 0.659292 -2.510236
C  -2.317918 1.722185 -1.253322
C  -0.981533 2.523103 -1.049544
C  -2.022325 -0.573855 0.810638
C  1.44562 -0.502907 -0.261754
C  2.437595 -0.432123 -1.268774
C  1.58602 -1.484057 0.756343
C  1.139311 1.926289 1.53016
C  -4.268673 -1.095082 1.630883
C  -3.162326 -2.658178 0.114835
C  3.538436 -1.31812 -1.263669
C  2.686518 -2.366607 0.767842
C  3.669273 -2.289676 -0.246951
C  0.948985 2.317149 2.982472
H  -2.584399 -0.312449 -2.142553
H  1.097996 1.947148 -1.603586
H  -0.842102 -1.418655 -0.791336
H  0.011574 -0.2279 -2.835059
H  -0.790428 1.281404 -3.393669
H  -2.951121 1.696526 -0.350899
H  -2.92824 2.156615 -2.066138
H  -0.903687 3.366819 -1.758762
H  -0.885867 2.939793 -0.033578
H  -2.246683 0.417296 1.239057
H  -1.444698 -1.127379 1.596669
H  2.367579 0.322472 -2.057477
H  0.830985 -1.546721 1.548522
H  -4.426741 -0.022896 1.84464
H  -3.929168 -1.589072 2.577696
H  -5.242297 -1.535152 1.349046
H  -4.15784 -3.089047 -0.094424
H  -2.671017 -3.286618 0.902403
H  -2.562545 -2.739606 -0.807715
H  4.298008 -1.242466 -2.050046
H  2.778901 -3.112429 1.565822
H  4.525055 -2.974053 -0.241597
H  1.298627 1.494171 3.632388
H  -0.116323 2.489431 3.2073
H  1.539204 3.218613 3.203852
