program: Gaussian 09
title: 000216044
version: EM64L-G09RevD.01
frameworkgroup: C1[X(C12H13N3O)]
method: RPBEPBE
basis: SDD
operation: Freq
keyword: #p
keyword: freq=noraman
keyword: PBEPBE/SDD
title: #p freq=noraman PBEPBE/SDD
converged: NO NO NO NO
title: Mulliken charges:
elementType: O N N N C C C C C C C C C C C C H H H H H H H H H H H H H
charge: -0.259924 -0.487576 -0.425971 -0.096893 0.323394 0.275703 0.021366 0.381618 0.153161 -0.454499 -0.346859 -0.386126 -0.842497 -0.235606 -0.251574 -0.786205 0.380692 0.284560 0.305065 0.225162 0.233065 0.233083 0.237770 0.328946 0.225051 0.224205 0.241318 0.241273 0.258299
chargesum: 0.00000
title: Mulliken charges with hydrogens summed into heavy atoms:
elementType: O N N N C C C C C C C C C C C C
charge: -0.259924 -0.106884 -0.097024 -0.096893 0.323394 0.275703 0.021366 0.381618 0.153161 -0.169939 -0.041794 -0.160965 -0.138579 -0.010556 -0.027369 -0.045316
polarizability: 2.57901815e+02 -2.45781618e+00 1.57737458e+02 -4.63521163e-03 -4.88386563e-03 7.04684964e+01
1716.lowfreq: -3.3336 -0.0011 -0.0009 -0.0008 8.8637 10.8412 38.1621 44.7027 65.9871
frequency: 37.9877 44.6297 65.8602 71.9525 94.7676 149.5872 185.9353 190.0082 190.8724 225.8855 276.7192 285.3111 317.7465 350.8878 418.8548 446.0064 482.3132 536.5764 542.9183 588.5895 603.1118 624.7295 658.4083 667.2534 725.2435 748.0207 754.8326 763.6303 779.6259 830.8143 852.4554 861.5089 880.1900 952.3010 964.2214 975.5123 983.6422 994.0406 1008.6807 1043.8865 1045.5911 1047.9833 1081.0185 1119.9970 1142.7772 1172.6646 1192.8405 1201.5200 1275.1278 1286.2570 1299.6004 1369.4496 1378.8496 1397.7603 1399.5565 1410.6555 1440.0836 1445.1601 1470.7710 1472.0018 1479.4598 1482.4289 1489.7974 1530.7688 1570.7502 1592.9822 1617.4445 1622.9426 2955.9966 2980.1717 3026.1781 3054.5234 3082.8241 3106.8923 3118.0003 3133.1514 3157.1804 3189.6673 3247.9667 3467.1937 3594.5153
redmass: 5.0751 4.3006 1.0355 4.5177 5.0837 4.0397 3.4044 4.6476 1.0696 5.0052 3.7648 4.8102 4.6881 3.6764 3.2625 2.9767 6.7442 5.9960 3.4121 6.4010 2.9000 4.3322 1.4827 4.5594 2.4570 2.2224 5.0596 1.4122 1.7105 4.7722 7.2456 1.4054 1.3072 1.3706 3.6001 1.6959 1.6053 1.3081 3.7439 1.5255 2.1014 1.4752 2.3810 1.6806 3.5678 1.0852 2.7136 2.4390 1.9777 2.5571 1.7630 3.3812 3.2504 1.7068 2.4273 1.2616 2.1643 2.6147 1.7116 1.0430 1.0437 1.2928 1.7552 2.3805 4.4767 6.5016 7.0521 3.5217 1.0392 1.0390 1.0978 1.0985 1.0959 1.0964 1.0870 1.0900 1.0984 1.0951 1.1000 1.0761 1.0822
irintensity: 3.2185 0.2164 0.0000 2.1338 3.8473 0.0304 0.3301 8.4907 0.7951 0.6200 3.8379 3.5699 1.0092 6.2601 0.1979 8.2479 4.4667 4.0576 1.7976 10.0475 24.3244 1.2652 71.9067 0.1595 21.6205 0.0343 11.7518 13.1189 147.8094 4.9677 21.7170 30.0739 3.2354 4.2316 15.8527 4.8036 3.9978 2.3150 11.7972 6.9240 18.4467 6.7872 4.4140 2.3548 30.4848 0.5665 41.7532 31.3121 13.7477 6.8893 42.8010 14.5245 31.0969 9.3108 75.3135 2.9820 21.3457 70.7984 67.6327 17.5629 13.4376 23.9686 41.6818 470.1225 37.3214 116.9443 18.9146 91.9096 27.2687 38.0114 21.0635 17.5114 21.2760 8.9660 9.7415 20.9845 35.1477 8.7383 2.3354 43.5542 65.4228
temp: 298.150 k
press: 1.00000 atm
elementType: 8 7 7 7 6 6 6 6 6 6 6 6 6 6 6 6 1 1 1 1 1 1 1 1 1 1 1 1 1
symmnumber: 1
zpe: 606064.2 jmol-1
zpe.correction: 0.230838 hartree
zpe.thermalcorrener: 0.245484 hartree
zpe.thermalcorrenthalpy: 0.246428 hartree
zpe.thermalcorrgfe: 0.188051 hartree
zpe.sumelectzpe: -703.426282 hartree
zpe.sumelectthermal: -703.411636 hartree
zpe.sumelectthermalent: -703.410692 hartree
zpe.sumelectthermalfe: -703.469069 hartree
dipole: -4.5461 4.1742 -0.0014
dipole: 6.1718
quadrupole: -60.6218 -90.3244 -98.9132
quadrupole: -4.2591 0.0012 0.0012
quadrupole: 22.6647 -7.0380 -15.6267 -4.2591 0.0012 0.0012
hfenergy: -703.6571198 hartree
pointgroup: C01 [X(C12H13N3O1)]
dipole: 1.7673907 1.6650317 -0.0046189 debye
polarizability: 257.8223895|3.7401517|157.8157675|0.066694|-0.3075351|70.4696128 unknown
InChI: InChI=1S/C12H13N3O/c1-8-5-3-4-6-10(8)13-12(16)11-7-9(2)14-15-11/h3-7,13-14H,1-2H3
charge 0 multiplicity 1
29 atoms
O  0.426339 -2.114475 0.009713
N  -0.432083 0.097707 0.002063
N  3.472963 1.296325 0.000078
N  2.102482 1.127205 0.000128
C  -1.838101 -0.093193 0.002048
C  -2.664156 1.077698 -0.002861
C  1.944215 -0.236538 0.00433
C  4.180383 0.095025 0.003973
C  0.585171 -0.85391 0.005909
C  3.202912 -0.912734 0.006746
C  -2.42471 -1.387305 0.006759
C  -4.066956 0.907592 -0.002833
C  -2.053379 2.470165 -0.007963
C  -3.829355 -1.519778 0.006599
C  -4.659523 -0.376766 0.001825
C  5.681478 0.04312 0.00456
H  -0.086801 1.064814 -0.000753
H  3.350645 -1.989539 0.010152
H  -1.773857 -2.263707 0.010452
H  -4.704339 1.800553 -0.006556
H  -1.422754 2.653515 0.885366
H  -1.421288 2.646312 -0.901695
H  -2.844245 3.238759 -0.011684
H  3.852513 2.242101 -0.002593
H  -4.270902 -2.522793 0.010268
H  -5.750205 -0.479442 0.001711
H  6.112398 0.528845 -0.891225
H  6.111918 0.535485 0.896943
H  6.017037 -1.005941 0.00854
