program: Gaussian 09
title: 000210656
version: EM64L-G09RevD.01
frameworkgroup: C1[X(C21H27N3O)]
method: RPBEPBE
basis: SDD
operation: Freq
keyword: #p
keyword: freq=noraman
keyword: PBEPBE/SDD
title: #p freq=noraman PBEPBE/SDD
converged: YES YES NO NO
title: Mulliken charges:
elementType: O N N N C C C C C C C C C C C C C C C C C C C C C H H H H H H H H H H H H H H H H H H H H H H H H H H H
charge: -0.233421 -0.072457 -0.317302 -0.060861 -0.347053 -0.364913 -0.400541 -0.392507 -0.397830 0.112752 0.244889 -0.485877 -0.344609 -0.484430 -0.420043 -0.423038 -0.126064 -0.521105 0.139507 0.406470 -0.335530 -0.376227 -0.229834 -0.206941 -0.244480 0.164491 0.211827 0.214403 0.164884 0.189371 0.202964 0.203227 0.189802 0.211049 0.188206 0.226547 0.250692 0.182586 0.240102 0.215228 0.250037 0.213586 0.206382 0.211167 0.215582 0.255979 0.252681 0.244857 0.280544 0.229720 0.232451 0.233078
chargesum: 0.00000
title: Mulliken charges with hydrogens summed into heavy atoms:
elementType: O N N N C C C C C C C C C C C C C C C C C C C C C
charge: -0.233421 -0.072457 -0.317302 -0.060861 0.029264 0.014375 -0.008206 0.000522 0.001424 0.112752 0.244889 -0.008638 0.078079 -0.019165 -0.000075 0.003711 -0.126064 -0.012445 0.139507 0.406470 -0.090673 -0.095683 -0.000113 0.025510 -0.011402
polarizability: 3.14061698e+02 -2.61528022e+01 3.01971620e+02 -1.55421363e+01 -5.80214731e+00 1.53911008e+02
1716.lowfreq: -8.3879 -1.8969 -1.6848 -0.0004 0.0004 0.0007 12.8103 22.0537 32.8188
frequency: 11.4614 21.6308 32.5841 42.9972 59.4095 64.8272 78.2081 91.6465 99.4488 124.0590 143.8038 159.2746 184.9504 214.6757 232.7363 245.2890 265.0273 293.6995 297.7727 300.5223 319.3421 360.2545 381.4558 406.0049 408.2176 413.6374 444.6173 450.5194 471.3836 478.7808 511.1046 548.3825 554.4120 612.5338 620.5629 644.6101 661.3365 678.6721 695.0806 700.1660 712.4624 754.1562 767.4813 782.5827 802.6981 817.9406 825.9075 839.3211 854.0641 854.4947 857.1592 904.5730 906.5152 914.8038 938.8796 959.8850 966.7741 972.1609 975.5667 988.7492 993.7330 995.0276 1025.4679 1032.9249 1046.9140 1059.3726 1071.6637 1078.5306 1081.7602 1086.3943 1108.3549 1111.4384 1112.4773 1123.1176 1135.0821 1149.6328 1152.4626 1155.4957 1171.8405 1173.2778 1185.5725 1198.1185 1222.4879 1235.9472 1240.8624 1257.8422 1261.4150 1265.7949 1281.2211 1292.3184 1296.3501 1317.3008 1324.3097 1330.0664 1331.4099 1336.2157 1340.2829 1343.7040 1344.2459 1348.7425 1351.9524 1372.2071 1386.8366 1394.6664 1409.6611 1433.3422 1446.1946 1452.0484 1453.2237 1459.2153 1460.5865 1462.5041 1466.9591 1468.3991 1471.3793 1473.5162 1480.6760 1482.1504 1491.6664 1563.9666 1579.9075 1598.7251 1612.2158 2809.6320 2820.7582 2855.7001 2959.0890 2965.8981 2979.5598 2981.2036 2983.6889 2984.2092 2984.2837 2987.1064 3023.1841 3024.7102 3030.2010 3035.5717 3039.7658 3043.7926 3045.2326 3049.0665 3053.0787 3056.5170 3058.7375 3133.3422 3144.5474 3162.7037 3179.4935 3185.1243
redmass: 3.7490 3.5011 4.1456 3.7190 4.5586 4.4223 2.4178 3.8955 3.3833 3.7576 2.9475 3.5949 3.2996 4.5840 2.2812 2.8600 3.5897 3.0320 3.8500 2.1842 2.2166 4.3698 1.8931 4.3367 3.3123 3.3250 3.2535 3.0286 3.6270 2.4576 3.3815 1.8298 3.1654 6.3201 6.1550 4.4686 4.2743 3.9320 2.0724 3.4483 5.0420 3.4434 1.7696 1.6951 1.6061 2.6531 1.6220 1.2544 2.3356 1.4207 2.8011 1.4807 2.3911 1.4164 3.1184 1.3313 2.8448 1.4421 2.9577 5.9754 1.3597 2.5405 2.1865 1.9285 2.4457 2.5702 2.2272 1.8755 1.8407 1.9306 2.1831 2.3872 2.1299 2.6354 1.1676 1.6823 1.3038 2.4722 1.2711 1.0528 1.1235 2.3003 1.7772 1.3814 1.5920 1.2629 1.6653 1.1769 1.2954 1.4079 1.5120 1.7170 1.4403 1.5776 1.3488 1.9942 1.4134 1.6297 1.5515 1.5982 1.8010 1.4438 9.6467 1.4864 4.2595 1.1392 2.1661 1.0901 1.2018 1.0959 1.0873 1.0868 1.0900 1.1993 1.0853 1.0964 1.2194 2.8586 3.1272 6.4686 7.5552 6.8703 6.1732 1.0716 1.0703 1.0708 1.0640 1.0620 1.0666 1.0647 1.0613 1.0654 1.0614 1.0621 1.0880 1.0948 1.0938 1.0898 1.0870 1.1031 1.0932 1.0994 1.1035 1.1026 1.0923 1.0854 1.0903 1.0958 1.0946 1.0973
irintensity: 0.4335 0.5813 0.2739 1.0360 1.6366 0.1776 2.7075 0.4076 0.3429 1.5430 1.8665 0.2607 7.5344 2.1078 0.6626 0.0369 4.3875 2.7312 4.5129 3.1314 0.0779 1.8444 4.5949 3.6259 1.8564 8.9736 0.3386 0.0504 8.5672 1.8005 3.0366 3.5496 3.5960 0.0547 9.4854 10.0674 2.5585 6.3718 39.6634 1.9249 15.9307 10.0613 58.4026 3.2466 1.8949 15.3698 3.6953 1.2929 10.5520 5.4070 11.4999 3.9945 11.1372 4.2952 14.8856 7.0884 51.7446 5.2679 8.7252 0.0630 0.5451 8.5340 8.7229 12.2860 7.7889 44.9652 19.0586 0.1880 7.8807 3.6620 98.5680 15.7722 13.9034 10.8726 0.5475 4.0152 6.9799 18.2993 2.6239 0.1191 1.0402 1.4890 29.0256 2.8892 3.2233 7.9907 13.8972 4.7741 13.5572 5.0364 23.1307 12.5534 2.3067 6.1285 2.6639 63.4606 0.1732 14.5992 3.1063 19.2632 88.0719 18.7239 0.0615 2.6947 69.7620 20.3914 3.5163 7.2809 3.5521 18.5422 13.4688 6.0246 8.0679 21.4775 4.7063 7.2005 15.9448 69.1777 70.6399 79.5120 104.9780 6.0024 40.3414 48.1508 121.7081 131.8285 31.5099 40.2061 34.7110 25.1104 31.2190 26.7333 28.7238 30.9788 55.6714 20.3761 89.5549 19.8486 2.0125 18.1099 35.8248 43.0491 102.8964 50.6357 27.4560 0.4729 14.1715 33.3124 9.5036 2.6230
temp: 298.150 k
press: 1.00000 atm
elementType: 8 7 7 7 6 6 6 6 6 6 6 6 6 6 6 6 6 6 6 6 6 6 6 6 6 1 1 1 1 1 1 1 1 1 1 1 1 1 1 1 1 1 1 1 1 1 1 1 1 1 1 1
symmnumber: 1
zpe: 1158515.4 jmol-1
zpe.correction: 0.441255 hartree
zpe.thermalcorrener: 0.464005 hartree
zpe.thermalcorrenthalpy: 0.464950 hartree
zpe.thermalcorrgfe: 0.386266 hartree
zpe.sumelectzpe: -1054.043490 hartree
zpe.sumelectthermal: -1054.020740 hartree
zpe.sumelectthermalent: -1054.019796 hartree
zpe.sumelectthermalfe: -1054.098479 hartree
dipole: -3.9708 1.9623 0.4174
dipole: 4.4488
quadrupole: -124.7216 -144.8073 -150.4292
quadrupole: 3.4000 -0.7671 -0.9924
quadrupole: 15.2644 -4.8213 -10.4432 3.4000 -0.7671 -0.9924
hfenergy: -1054.4847451 hartree
pointgroup: C01 [X(C21H27N3O1)]
dipole: -1.5871487 0.7113869 0.1961004 debye
polarizability: 315.6543711|-25.2229572|300.3868843|-17.2126768|-1.9399361|153.9030704 unknown
InChI: InChI=1S/C21H27N3O/c25-20(13-16-23-14-7-2-8-15-23)21-18-11-5-6-12-19(18)24(22-21)17-9-3-1-4-10-17/h1,3-4,9-10H,2,5-8,11-16H2
charge 0 multiplicity 1
52 atoms
O  1.232784 -2.791544 -0.053977
N  4.490179 -0.033416 -0.130527
N  -2.187202 0.232785 0.089132
N  -0.79691 0.212278 0.051386
C  4.516204 1.143885 0.775627
C  5.823021 -0.689892 -0.19133
C  5.561761 2.181209 0.316774
C  6.907027 0.288073 -0.687009
C  6.964855 1.541259 0.215678
C  -1.648612 -1.950786 0.015486
C  -2.732059 -1.064121 0.060665
C  -1.805917 -3.449871 -0.043423
C  3.426472 -1.007733 0.221811
C  -4.183385 -1.464538 -0.003209
C  -3.278137 -3.852787 0.234468
C  -4.276505 -2.930793 -0.509076
C  -0.472006 -1.12363 0.009648
C  2.016373 -0.465356 -0.066587
C  0.944361 -1.553665 -0.030564
C  -2.848344 1.50617 0.101161
C  -4.119119 1.664992 0.706583
C  -2.194421 2.618686 -0.484986
C  -4.741567 2.932364 0.700031
C  -2.822795 3.880002 -0.477096
C  -4.101138 4.043951 0.107901
H  4.747189 0.829036 1.830139
H  3.513766 1.608024 0.78599
H  5.748908 -1.555582 -0.875952
H  6.124151 -1.087088 0.815904
H  5.569559 3.032722 1.02468
H  5.262029 2.571227 -0.675317
H  6.665738 0.590336 -1.724601
H  7.886856 -0.22734 -0.705501
H  7.69822 2.271212 -0.17696
H  7.309571 1.248735 1.229536
H  -1.488322 -3.813965 -1.040958
H  -1.117197 -3.93357 0.671897
H  3.491469 -1.32841 1.293579
H  3.577121 -1.918617 -0.384605
H  -4.65439 -1.401336 0.999563
H  -4.756465 -0.78897 -0.666617
H  -3.437811 -4.904312 -0.068394
H  -3.479573 -3.797073 1.323424
H  -5.311671 -3.295337 -0.371245
H  -4.06128 -2.95913 -1.595407
H  1.715474 0.346238 0.619881
H  2.010397 -0.012088 -1.079878
H  -4.607124 0.824358 1.20572
H  -1.205769 2.476361 -0.927947
H  -5.722772 3.050735 1.17247
H  -2.314466 4.736568 -0.932901
H  -4.587026 5.025351 0.107831
