program: Gaussian 09
title: 000210644
version: EM64L-G09RevD.01
frameworkgroup: C1[X(C13H20N2OS)]
method: RPBEPBE
basis: SDD
operation: Freq
keyword: #p
keyword: freq=noraman
keyword: PBEPBE/SDD
title: #p freq=noraman PBEPBE/SDD
converged: YES YES NO NO
title: Mulliken charges:
elementType: S O N N C C C C C C C C C C C C C H H H H H H H H H H H H H H H H H H H H
charge: 0.275055 -0.453677 -0.317302 -0.009562 0.447313 -0.517453 -0.466982 -0.565856 -0.416711 -0.400631 0.084363 -0.396846 -0.298767 0.664130 -0.702378 -0.758809 -0.800489 0.228926 0.230811 0.198729 0.227807 0.233246 0.263746 0.226517 0.200218 0.201535 0.217241 0.190136 0.209904 0.212291 0.223187 0.234480 0.274170 0.351105 0.243946 0.239728 0.226880
chargesum: 0.00000
title: Mulliken charges with hydrogens summed into heavy atoms:
elementType: S O N N C C C C C C C C C C C C C
charge: 0.275055 -0.102572 -0.317302 -0.009562 0.447313 -0.057716 -0.040445 -0.068865 0.010023 0.018145 0.084363 0.003194 -0.298767 0.664130 -0.032420 -0.484639 -0.089935
polarizability: 1.94738543e+02 7.22558643e+00 1.90545080e+02 -3.86109453e+00 9.98276827e-01 1.19061654e+02
1716.lowfreq: -5.4646 0.0005 0.0017 0.0017 8.5611 16.6626 29.5304 84.0213 96.3448
frequency: 27.8874 83.9410 96.3283 122.4611 154.6741 182.7641 210.3866 217.0988 222.6786 234.5287 267.4387 275.5400 300.5321 305.0790 312.8128 324.2492 366.0306 379.2397 400.7199 435.8829 454.1597 461.2577 486.1904 506.2787 520.7010 542.7065 551.2696 602.5568 621.4213 669.7079 689.7649 760.9569 780.9982 789.0415 800.4971 827.2827 836.7568 849.5586 888.5259 914.4593 923.1329 937.7783 951.8221 980.6658 1002.7053 1012.4880 1044.6064 1046.2141 1055.9597 1058.5298 1082.7748 1105.9054 1113.1506 1124.4948 1143.7590 1161.1609 1167.7700 1194.9570 1213.9278 1249.6504 1268.1281 1275.3648 1298.2949 1313.4510 1321.6877 1330.6996 1334.6250 1339.3681 1341.7699 1346.6759 1353.2240 1380.4758 1407.2200 1446.4244 1455.9605 1460.3548 1461.0604 1466.3857 1474.8840 1479.5079 1480.5921 1486.5422 1493.2222 1597.9733 1622.5847 2965.6552 2982.2726 2985.4249 2987.9435 2991.4314 2993.3500 3008.3685 3020.0918 3032.9487 3039.9827 3048.4587 3055.0416 3065.0839 3088.0564 3093.6751 3095.8235 3099.0836 3103.3446 3246.8968 3534.9919
redmass: 4.3643 3.5015 4.1923 3.3892 2.8373 1.4543 1.7843 3.4866 2.3190 2.1459 1.7588 2.6516 2.3426 3.1292 1.5333 2.3372 2.2080 2.8088 2.6451 3.5084 3.5003 3.1848 3.6327 2.0368 5.3378 3.9750 3.8936 3.5995 8.3919 3.4668 1.2614 4.6483 1.6264 3.4642 3.6814 2.2129 3.3345 1.9718 2.5463 2.1244 1.8330 1.6048 2.4504 2.6696 1.6834 1.6600 1.4639 1.9171 1.8635 3.2219 1.2821 1.7941 2.4731 1.8281 1.6271 1.7838 2.6218 2.5764 2.1752 1.3277 1.3210 1.5372 1.5720 1.6803 1.4738 2.9687 1.3912 1.6323 1.4468 1.4753 1.4989 1.2365 1.2258 1.0757 1.0733 1.0769 1.0701 1.0752 1.0786 1.0813 1.0842 1.0805 1.0812 7.9240 8.4490 1.0638 1.0391 1.0619 1.0623 1.0618 1.0351 1.0666 1.0631 1.0953 1.1000 1.1004 1.0999 1.0992 1.0980 1.0995 1.0984 1.0993 1.0934 1.0966 1.0650
irintensity: 0.5066 0.3665 0.2552 0.8485 2.1347 59.3173 11.5378 4.7441 4.8566 45.9927 9.4838 7.9641 1.1238 2.7850 0.0229 12.6569 3.9302 10.8387 2.8429 0.5869 0.2416 9.9693 4.5427 0.1966 7.1056 6.9505 4.6083 16.2501 12.7876 5.4118 47.1626 4.7662 1.0452 5.3763 12.8907 15.0186 62.7898 5.7756 12.1905 8.6110 9.0044 5.3027 16.2875 8.3093 1.2784 1.2251 7.5784 14.6532 26.0818 6.4245 33.4383 3.3698 2.5339 97.0950 25.2996 81.9335 17.3528 32.2430 15.9806 7.7405 4.0866 29.3347 14.9975 29.9027 29.0323 100.2132 6.4880 9.7237 36.4631 12.9902 0.6742 23.7786 14.8798 8.6042 10.2411 15.7393 2.1160 12.2586 9.5429 12.9477 4.8536 28.8500 12.6194 208.4516 372.8451 32.5464 35.6045 25.8646 24.9134 27.2052 22.6218 32.2023 15.6393 63.3342 29.7646 23.4308 58.2419 18.2931 35.1362 6.6947 34.9793 33.7725 27.4031 4.3495 9.8438
temp: 298.150 k
press: 1.00000 atm
elementType: 16 8 7 7 6 6 6 6 6 6 6 6 6 6 6 6 6 1 1 1 1 1 1 1 1 1 1 1 1 1 1 1 1 1 1 1 1
symmnumber: 1
zpe: 817768.5 jmol-1
zpe.correction: 0.311472 hartree
zpe.thermalcorrener: 0.328049 hartree
zpe.thermalcorrenthalpy: 0.328993 hartree
zpe.thermalcorrgfe: 0.268755 hartree
zpe.sumelectzpe: -1088.839522 hartree
zpe.sumelectthermal: -1088.822944 hartree
zpe.sumelectthermalent: -1088.822000 hartree
zpe.sumelectthermalfe: -1088.882238 hartree
dipole: 3.0362 -4.2060 0.8108
dipole: 5.2504
quadrupole: -111.1647 -107.1200 -113.6248
quadrupole: 1.9606 1.4290 3.5245
quadrupole: -0.5282 3.5165 -2.9883 1.9606 1.4290 3.5245
hfenergy: -1089.1509931 hartree
pointgroup: C01 [X(C13H20N2O1S1)]
dipole: -1.3241197 -1.5560526 -0.3039621 debye
polarizability: 193.5081548|-7.4851809|191.7064045|-4.4724831|-0.8634439|119.1307176 unknown
InChI: InChI=1S/C13H20N2OS/c1-10-8-17-11-14-12(2,16)9-13(15(10)11)6-4-3-5-7-13/h8,16H,3-7,9H2,1-2H3
charge 0 multiplicity 1
37 atoms
S  3.462432 -0.535952 -0.260479
O  0.6381 3.205561 1.181947
N  0.815343 -0.727839 0.122768
N  1.708756 1.559486 -0.156204
C  -0.628061 -0.24561 0.161905
C  -1.506952 -1.08973 1.136418
C  -1.218632 -0.360453 -1.278191
C  -0.60481 1.207679 0.736024
C  -2.996959 -0.66007 1.095554
C  -2.709893 0.046756 -1.350794
C  0.408337 2.193099 0.114692
C  -3.564134 -0.758146 -0.341565
C  1.816441 0.264274 -0.075334
C  1.298973 -2.070408 0.009926
C  -0.077572 2.950659 -1.137131
C  2.652822 -2.148141 -0.180004
C  0.455584 -3.321787 0.089409
H  -1.100969 -1.009235 2.162591
H  -1.479211 -2.15235 0.852005
H  -1.124218 -1.416443 -1.602092
H  -0.613402 0.233875 -1.985332
H  -1.613068 1.645442 0.683724
H  -0.335571 1.139084 1.806133
H  -3.122087 0.369073 1.480608
H  -3.573982 -1.317921 1.773764
H  -3.082263 -0.121299 -2.379699
H  -2.818787 1.131092 -1.154231
H  -3.578384 -1.824078 -0.651595
H  -4.613005 -0.405823 -0.362555
H  -0.361251 2.272352 -1.959706
H  -0.945171 3.579925 -0.871399
H  0.734881 3.603795 -1.499526
H  3.241005 -3.055858 -0.282713
H  1.575239 3.512341 1.058627
H  0.05327 -3.498757 1.102758
H  1.096577 -4.182488 -0.164976
H  -0.38898 -3.317606 -0.622927
