program: Gaussian 09
title: 000216068
version: EM64L-G09RevD.01
frameworkgroup: C1[X(C20H24N2)]
method: RPBEPBE
basis: SDD
operation: Freq
keyword: #pfreq=noraman
keyword: PBEPBE/SDD
title: #p freq=noraman PBEPBE/SDD
converged: YES YES NO NO
title: Mulliken charges:
elementType: N N C C C C C C C C C C C C C C C C C C C C H H H H H H H H H H H H H H H H H H H H H H H H
charge: -0.337293 -0.107128 -0.345264 -0.046063 -0.604172 -0.596298 0.412929 0.420646 -0.482468 0.351982 0.318388 -0.382267 -0.472552 -0.467239 -0.447950 -0.368919 -0.238557 -0.239954 -0.243824 -0.259342 -0.623457 -0.608208 0.209454 0.221386 0.245151 0.235600 0.221960 0.280495 0.199792 0.232287 0.187309 0.238666 0.238292 0.232368 0.225511 0.230754 0.222687 0.223352 0.224903 0.224859 0.189506 0.220368 0.230571 0.224908 0.219075 0.187755
chargesum: 0.00000
title: Mulliken charges with hydrogens summed into heavy atoms:
elementType: N N C C C C C C C C C C C C C C C C C C C C
charge: -0.056798 -0.107128 -0.135810 0.175323 -0.359021 -0.138739 0.412929 0.420646 -0.050389 0.351982 0.318388 0.043708 -0.234260 -0.234871 -0.222438 -0.138165 -0.015870 -0.016602 -0.018922 -0.034482 0.016988 0.023529
polarizability: 2.08458483e+02 2.45898792e+00 2.45451952e+02 -1.27461772e+01 -5.82309179e+00 2.05184831e+02
1716.lowfreq: -8.6787 -0.0005 -0.0002 0.0007 9.2856 9.9453 20.5422 35.2481 53.3289
frequency: 20.3855 35.0441 53.3154 68.9819 85.6467 113.8886 130.5559 147.9553 182.7807 205.7764 228.9351 248.5378 265.2936 281.7482 294.6009 316.7067 323.3742 341.2712 356.3967 387.0571 413.0636 428.6555 444.2505 465.8516 477.3952 500.9029 536.9615 562.2315 578.2221 604.4958 610.7393 654.4876 674.9931 705.8909 723.5142 732.4437 755.6731 763.2748 768.9344 786.3752 799.5111 809.6386 853.4842 871.2163 884.7477 901.6041 913.0982 938.2404 947.6684 948.9719 966.1920 982.9177 984.1625 997.8477 1027.9284 1029.7598 1031.9411 1036.8728 1051.0517 1055.1263 1084.3471 1099.1042 1102.2914 1114.5112 1131.2118 1144.0702 1163.8319 1170.4762 1172.3595 1179.0257 1186.3977 1198.0533 1206.3083 1213.8950 1222.9569 1232.2083 1239.4822 1245.6608 1265.3415 1270.4855 1277.8926 1315.1396 1317.3542 1335.9423 1349.9218 1356.8862 1361.2585 1371.6296 1383.7783 1395.4587 1416.0105 1418.7602 1433.5732 1437.9161 1443.5428 1448.2271 1452.1008 1460.5770 1466.0970 1475.5963 1476.7381 1483.5854 1486.6332 1487.7316 1586.7950 1600.1634 1606.7519 1617.6970 2839.2997 2847.1552 2864.3641 2931.2701 2953.7459 2969.5616 2996.3524 3001.8441 3005.9004 3015.8419 3023.5907 3026.9989 3044.8647 3075.0413 3081.9660 3104.4832 3108.3166 3111.8280 3118.8948 3133.0765 3135.6539 3156.4317 3157.6935 3454.9881
redmass: 3.7410 4.0258 4.4430 2.7692 3.5472 3.8463 3.6631 3.5590 3.4237 1.7346 1.1454 1.8422 2.4280 2.8719 2.4116 3.9114 3.5428 4.1050 2.1763 2.8052 2.1049 4.6020 2.9634 3.0319 3.6730 3.9329 4.9371 3.0482 3.2162 3.4113 4.6009 2.8039 4.3139 3.5693 2.5414 2.4430 2.0433 2.1428 1.7386 2.2790 3.1530 3.2482 3.2162 1.5050 1.5840 2.9865 2.2867 1.5828 1.4403 2.2399 1.9776 1.3329 1.3217 3.1453 2.4754 2.2131 1.5800 2.1380 2.2287 2.1105 1.3897 2.0102 2.0485 1.7178 1.8918 2.2193 1.7706 1.1089 1.1110 2.1275 2.2248 1.4793 1.4420 1.4752 1.4775 1.7981 1.3308 1.6221 2.1151 1.6217 1.4758 1.3422 1.5259 1.4770 1.4866 1.3934 1.5248 1.4582 3.9578 4.1510 1.1466 1.3778 2.2012 1.1668 1.2353 2.0208 1.0788 1.0572 1.0812 1.0795 1.0514 2.3391 1.1133 2.4111 6.5342 6.8192 6.2513 6.8385 1.0697 1.0570 1.0580 1.0833 1.0602 1.0613 1.0851 1.0990 1.0862 1.0726 1.0770 1.0895 1.0928 1.1011 1.1004 1.0868 1.0891 1.0867 1.0887 1.0917 1.0932 1.1004 1.1003 1.0751
irintensity: 0.3615 0.0984 0.1573 0.1760 0.5455 0.0969 0.2099 1.1047 0.8450 0.2979 0.2553 2.9706 0.2086 2.1342 2.0686 7.6945 10.0103 0.6699 6.9421 1.1463 1.2584 5.6574 6.1136 5.1533 0.8229 12.9578 2.4311 30.5760 12.5592 3.3915 12.9426 79.7137 1.3561 39.7837 8.5951 21.0527 22.7223 28.5247 33.5903 26.7105 0.6499 3.6630 2.6465 0.0448 0.0310 9.7788 0.4263 3.5556 0.5805 14.5640 27.3311 0.4156 0.0171 10.5829 5.4089 2.8244 14.8529 5.2324 16.4878 8.6192 2.8432 5.4586 0.3894 8.0943 25.8514 15.5095 11.7772 0.2440 0.1791 5.9357 3.4062 2.6217 0.8556 4.5303 23.1919 9.8538 2.9205 3.5571 8.7152 1.0091 3.6324 10.4349 2.6658 1.7323 1.8279 2.3955 0.9235 13.1518 1.4881 2.0437 7.2894 25.5497 5.9498 4.1604 6.5234 10.0317 4.5300 15.0106 10.9185 19.4185 5.6350 21.2165 5.7363 23.4565 2.0218 0.7868 0.1835 0.1959 54.3755 67.7138 318.8691 38.2954 23.1420 31.9616 54.3412 38.1278 15.3946 36.5609 20.4973 33.1057 39.2412 30.7381 48.2544 17.8459 1.3370 9.2727 2.6659 23.6999 31.7742 47.2202 35.4492 8.8314
temp: 298.150 k
press: 1.00000 atm
elementType: 7 7 6 6 6 6 6 6 6 6 6 6 6 6 6 6 6 6 6 6 6 6 1 1 1 1 1 1 1 1 1 1 1 1 1 1 1 1 1 1 1 1 1 1 1 1
symmnumber: 1
zpe: 1031022.7 jmol-1
zpe.correction: 0.392696 hartree
zpe.thermalcorrener: 0.411865 hartree
zpe.thermalcorrenthalpy: 0.412809 hartree
zpe.thermalcorrgfe: 0.344894 hartree
zpe.sumelectzpe: -884.404387 hartree
zpe.sumelectthermal: -884.385217 hartree
zpe.sumelectthermalent: -884.384273 hartree
zpe.sumelectthermalfe: -884.452189 hartree
dipole: -1.2477 0.4192 0.7521
dipole: 1.5159
quadrupole: -127.5288 -128.1868 -120.5382
quadrupole: -1.3083 -2.2824 -2.3609
quadrupole: -2.1108 -2.7689 4.8797 -1.3083 -2.2824 -2.3609
hfenergy: -884.7970824 hartree
pointgroup: C01 [X(C20H24N2)]
dipole: -0.474373 0.2078864 0.2957379 debye
polarizability: 209.5962712|6.4722071|244.7387896|-13.0975603|-3.6034772|204.7602059 unknown
InChI: InChI=1S/C20H24N2/c1-22(2)12-11-19-18-13-14-7-3-4-8-15(14)20(21-19)17-10-6-5-9-16(17)18/h3-10,18-21H,11-13H2,1-2H3
charge 0 multiplicity 1
46 atoms
N  -0.940752 0.122485 -0.859362
N  -4.023561 0.886585 -0.302071
C  -0.171048 -0.7232 1.380334
C  -1.34813 -0.109209 0.556817
C  0.513262 0.058491 -1.162122
C  0.780445 0.385236 1.922401
C  0.612296 -1.736685 0.559968
C  1.007853 -1.318088 -0.736679
C  -2.606104 -1.014483 0.600481
C  1.340182 1.184871 -0.508613
C  1.434495 1.331261 0.907465
C  -3.703613 -0.564007 -0.385528
C  0.995082 -3.010973 1.030496
C  1.790665 -2.164062 -1.546842
C  2.002164 2.11717 -1.347314
C  2.195017 2.410293 1.426588
C  1.78252 -3.862472 0.218475
C  2.184003 -3.437135 -1.068879
C  2.754228 3.187061 -0.817181
C  2.851202 3.333735 0.584961
C  -4.613968 1.278368 0.994524
C  -4.870543 1.320926 -1.433351
H  -0.606857 -1.228381 2.264653
H  -1.612937 0.860223 1.034067
H  0.621373 0.156693 -2.258928
H  1.585938 -0.105369 2.507545
H  0.208355 1.001984 2.645845
H  -1.39791 0.964499 -1.232699
H  -2.99347 -1.047921 1.639566
H  -2.316346 -2.048125 0.326535
H  -4.61913 -1.193503 -0.232054
H  -3.332669 -0.757372 -1.408163
H  0.6828 -3.339439 2.029882
H  2.092223 -1.835493 -2.548936
H  1.923841 1.996785 -2.435839
H  2.273682 2.525146 2.515878
H  2.079639 -4.851053 0.586745
H  2.793285 -4.09548 -1.69846
H  3.256763 3.894941 -1.4859
H  3.429843 4.157609 1.017696
H  -5.588099 0.766152 1.204819
H  -4.791573 2.368929 1.00562
H  -3.920557 1.040115 1.819119
H  -4.370967 1.07501 -2.387465
H  -5.017502 2.415602 -1.392558
H  -5.881224 0.837878 -1.440337
