program: Gaussian 09
title: 000210638
version: EM64L-G09RevD.01
frameworkgroup: C1[X(C14H18N2S)]
method: RPBEPBE
basis: SDD
operation: Freq
keyword: #p
keyword: freq=noraman
keyword: PBEPBE/SDD
title: #p freq=noraman PBEPBE/SDD
converged: YES YES NO NO
title: Mulliken charges:
elementType: S N N C C C C C C C C C C C C C C H H H H H H H H H H H H H H H H H H
charge: 0.269710 0.043777 -0.284359 0.097061 0.184054 -0.449080 -0.510157 -0.451712 -0.434029 0.178637 -0.533522 -0.478178 -0.469540 -0.371396 0.650920 -0.757491 -0.786974 0.225658 0.226148 0.217398 0.239610 0.212568 0.211108 0.221463 0.214385 0.224367 0.223493 0.229033 0.225095 0.224434 0.219294 0.271503 0.234721 0.238200 0.243803
chargesum: 0.00000
title: Mulliken charges with hydrogens summed into heavy atoms:
elementType: S N N C C C C C C C C C C C C C C
charge: 0.269710 0.043777 -0.284359 0.097061 0.184054 0.002726 -0.053149 -0.028036 0.001819 0.178637 -0.085662 -0.024050 -0.025813 -0.371396 0.650920 -0.485988 -0.070250
polarizability: 2.39880923e+02 3.19876608e+00 1.78622491e+02 -2.56607472e+00 3.20265262e+00 1.11608044e+02
1716.lowfreq: -4.1481 -2.7218 -0.0023 -0.0013 -0.0007 7.9006 18.8031 85.6667 92.5846
frequency: 18.1823 85.6476 92.5740 112.7363 127.3373 128.8358 166.6037 214.6711 229.5888 244.4191 252.5360 271.2699 283.1588 328.1466 354.4028 362.9932 432.1203 479.9206 523.5089 532.8651 536.9309 564.2268 600.7984 627.4995 644.6269 651.1598 662.9918 684.6933 758.9790 779.6770 794.7235 805.7872 832.0862 857.7766 887.9469 898.5622 927.0299 928.6055 958.9322 975.2047 989.0593 1009.1344 1025.6972 1035.3954 1041.3092 1048.4429 1067.2497 1075.0172 1098.3216 1110.8295 1139.0819 1159.1456 1171.5336 1184.6169 1193.6584 1204.5899 1208.3732 1226.3264 1258.1404 1267.4051 1268.4504 1285.7460 1299.9555 1303.9840 1310.7367 1313.3818 1350.3949 1379.5028 1407.4271 1460.0803 1460.5941 1463.8070 1469.7245 1473.1416 1474.3018 1480.3410 1487.3102 1494.3892 1598.7984 1633.0596 1660.6415 2959.0629 2965.6695 2985.9437 2992.5679 2997.1295 3004.3377 3008.3861 3016.5301 3029.6782 3039.8090 3053.5603 3058.7961 3068.7306 3069.0990 3078.7082 3081.5443 3099.2447 3246.7471
redmass: 3.7663 2.7766 2.5524 2.5099 2.2438 2.5565 2.2551 3.4119 3.8853 2.9747 2.8432 2.2114 1.4894 4.6337 5.9639 3.6916 4.1028 5.8130 4.4709 3.9150 4.7032 3.8614 4.1145 4.4038 3.6728 4.5619 2.3049 1.3062 2.2924 2.2238 1.6047 3.1851 2.0164 3.6343 2.4486 1.7359 3.1080 2.5022 2.2184 1.8898 2.6235 2.3401 1.5157 2.3411 1.7419 1.4497 2.9970 2.8503 3.9922 2.1319 1.2162 2.4172 1.4511 1.3741 1.4723 1.3021 1.3967 1.1659 1.6414 1.5792 1.4134 1.3424 1.9439 1.4123 1.4770 1.5976 3.1280 5.4511 1.2635 1.0821 1.0822 1.0806 1.0623 1.0849 1.0869 1.0860 1.0977 1.0952 8.0271 8.0564 9.1154 1.0671 1.0674 1.0377 1.0581 1.0623 1.0607 1.0669 1.0650 1.0890 1.1013 1.0919 1.1023 1.1043 1.0985 1.1041 1.1045 1.0978 1.0966
irintensity: 1.0971 0.1729 0.5930 0.0940 0.2377 0.3973 3.0652 2.3608 0.4900 1.1556 0.7950 0.7552 0.3703 0.4151 8.6952 0.2552 5.5685 1.2550 3.0612 3.9260 1.3131 0.1845 11.1264 1.6717 6.0592 4.5853 1.8561 50.2337 12.0360 10.4856 1.3155 18.2908 3.6767 0.6050 1.1940 2.0183 0.4266 1.0946 9.5263 5.8313 2.0336 3.6222 1.7007 2.6651 1.9274 6.5941 7.0176 40.5911 6.7048 6.2171 1.9371 6.9460 9.4578 0.5383 12.1290 4.3018 0.6912 1.1159 15.8636 11.1318 4.6492 0.7345 12.2266 1.2965 1.5207 10.1353 13.0612 180.1712 19.4226 5.9391 16.6888 6.0402 21.9880 14.1931 5.0488 3.0776 9.4897 6.9502 81.8919 239.2142 244.8177 44.9794 42.9197 33.2747 7.2439 41.0964 59.8721 27.4769 41.5522 43.7206 13.4134 31.3993 8.8299 13.9625 16.0507 51.0091 85.3057 21.8244 6.0521
temp: 298.150 k
press: 1.00000 atm
elementType: 16 7 7 6 6 6 6 6 6 6 6 6 6 6 6 6 6 1 1 1 1 1 1 1 1 1 1 1 1 1 1 1 1 1 1
symmnumber: 1
zpe: 765397.1 jmol-1
zpe.correction: 0.291524 hartree
zpe.thermalcorrener: 0.306993 hartree
zpe.thermalcorrenthalpy: 0.307937 hartree
zpe.thermalcorrgfe: 0.248629 hartree
zpe.sumelectzpe: -1050.559603 hartree
zpe.sumelectthermal: -1050.544134 hartree
zpe.sumelectthermalent: -1050.543190 hartree
zpe.sumelectthermalfe: -1050.602498 hartree
dipole: -0.4541 4.3890 0.5323
dipole: 4.4444
quadrupole: -97.5541 -109.6217 -110.8308
quadrupole: -5.0388 -1.6671 -1.0962
quadrupole: 8.4481 -3.6195 -4.8286 -5.0388 -1.6671 -1.0962
hfenergy: -1050.8511274 hartree
pointgroup: C01 [X(C14H18N2S1)]
dipole: 0.5168992 1.6443053 -0.2942744 debye
polarizability: 236.1899937|-15.0450363|181.8499569|-2.9884235|-6.0681321|112.0715078 unknown
InChI: InChI=1S/C14H18N2S/c1-10-9-17-13-15-14(7-2-3-8-14)11-5-4-6-12(11)16(10)13/h9H,2-8H2,1H3
charge 0 multiplicity 1
35 atoms
S  2.158268 -2.83411 0.448526
N  -0.368072 -1.706286 0.388338
N  1.573978 -0.255123 0.020149
C  -1.348609 -0.594713 0.15355
C  -0.634591 0.752796 0.149028
C  -2.131618 -0.877272 -1.175762
C  -2.492502 -0.69095 1.214319
C  -3.522443 -0.211389 -1.009177
C  -3.785424 -0.153563 0.536579
C  0.725133 0.889322 0.05615
C  -1.289713 2.109929 0.359731
C  1.18549 2.33487 0.192703
C  -0.150272 3.125147 0.039364
C  0.901283 -1.498342 0.272819
C  2.987643 -0.350376 -0.109666
C  3.459305 -1.62136 0.082195
C  3.860974 0.82072 -0.480143
H  -2.229256 -1.977328 -1.253694
H  -1.577682 -0.524113 -2.063583
H  -2.239343 -0.162301 2.150526
H  -2.593685 -1.763544 1.459247
H  -4.306581 -0.78052 -1.539512
H  -3.523267 0.807323 -1.43938
H  -4.003404 0.88238 0.853827
H  -4.660722 -0.764334 0.821677
H  -2.171696 2.271224 -0.287084
H  -1.645387 2.210821 1.406509
H  1.651273 2.500311 1.186211
H  1.921376 2.646607 -0.567613
H  -0.24973 3.468281 -1.006319
H  -0.182167 4.017742 0.687657
H  4.492907 -1.94859 0.008783
H  3.560881 1.264077 -1.447364
H  4.901854 0.471211 -0.57735
H  3.843997 1.61855 0.282959
