program: Gaussian 09
title: 000210636
version: EM64L-G09RevD.01
frameworkgroup: C1[X(C16H22N2S)]
method: RPBEPBE
basis: SDD
operation: Freq
keyword: #p
keyword: freq=noraman
keyword: PBEPBE/SDD
title: #p freq=noraman PBEPBE/SDD
converged: NO YES NO NO
title: Mulliken charges:
elementType: S N N C C C C C C C C C C C C C C C C H H H H H H H H H H H H H H H H H H H H H H
charge: 0.264334 -0.002904 -0.309322 0.139666 0.199385 -0.467644 -0.475724 0.212711 -0.384950 -0.413666 -0.521609 -0.387450 -0.468574 -0.429475 -0.429239 -0.350807 0.610945 -0.744953 -0.778850 0.196646 0.217712 0.213893 0.190061 0.186386 0.220538 0.233235 0.185327 0.222763 0.223097 0.198441 0.180580 0.218030 0.230696 0.210520 0.203281 0.207692 0.212086 0.270318 0.236662 0.238195 0.241966
chargesum: 0.00000
title: Mulliken charges with hydrogens summed into heavy atoms:
elementType: S N N C C C C C C C C C C C C C C C C
charge: 0.264334 -0.002904 -0.309322 0.139666 0.199385 -0.053286 -0.071770 0.212711 0.021974 0.004896 -0.075749 -0.008428 -0.019848 -0.015674 -0.009462 -0.350807 0.610945 -0.474635 -0.062026
polarizability: 2.37583396e+02 -1.63093211e+01 2.13180023e+02 8.73918350e+00 8.27665549e+00 1.38452180e+02
1716.lowfreq: -13.2546 -6.8531 -0.0019 -0.0016 -0.0008 12.7118 36.0861 77.6980 81.5035
frequency: 35.7289 77.6694 81.4227 106.6703 129.1501 168.3057 179.6195 199.2732 208.6147 220.9395 236.1906 254.9322 272.1940 309.9929 331.9526 342.9718 356.2409 367.1931 422.2368 452.4213 463.0779 476.2724 487.7227 502.4885 522.5136 527.5427 547.8524 584.0556 609.9729 635.5245 672.8793 689.2160 740.9407 773.6462 782.6034 816.2929 827.1173 840.7469 848.9015 871.6978 892.9438 908.3159 917.4381 927.6239 937.8441 964.6933 990.6096 1002.5434 1016.7224 1046.4463 1049.9035 1061.5599 1072.7568 1083.4971 1097.6539 1102.8232 1135.5078 1137.9041 1142.7243 1149.4954 1164.8888 1171.7700 1190.2009 1202.4658 1242.1451 1249.8503 1261.0005 1271.3618 1275.5207 1282.7197 1315.8148 1328.3499 1336.6423 1336.9795 1340.8730 1343.8062 1347.6149 1355.7059 1357.6967 1359.0209 1405.2827 1446.4772 1453.1938 1454.9046 1456.0925 1461.7503 1465.6340 1466.4567 1470.5406 1473.6511 1475.0853 1486.9431 1595.1047 1626.5083 1661.0147 2953.2316 2955.2824 2962.2545 2966.2188 2976.4652 2980.5630 2983.6776 2984.0301 2989.3024 2991.2658 2997.7752 3021.5157 3024.1594 3028.5794 3040.4657 3041.6902 3047.2310 3051.0808 3058.8605 3072.6572 3097.0048 3243.7399
redmass: 4.0786 3.4188 4.1322 3.1376 2.8396 2.6379 1.3906 3.4523 3.3507 2.5604 3.3294 2.3907 2.4321 2.1307 3.0603 2.7977 2.3745 3.2312 2.9893 4.1952 3.5975 2.3889 3.1604 4.4994 2.4224 3.9514 4.1491 4.5175 5.2057 5.9488 3.1436 1.2970 3.5712 1.5161 4.1880 3.2877 2.5607 1.6378 1.9022 2.9851 2.2462 2.1739 1.6142 1.4919 2.4811 3.1103 2.7326 1.6488 2.4056 1.4435 1.8025 1.6483 2.6162 2.0243 1.6147 1.8839 1.2227 1.9327 2.3787 1.8935 2.0143 1.5816 2.1629 2.1091 1.8338 1.2712 1.3460 1.3483 1.2705 1.5821 1.3650 1.7130 1.4460 1.5361 1.5624 1.4337 2.0453 1.5803 1.7332 1.8822 1.2357 1.0881 1.0932 1.0856 1.0829 1.0797 1.0812 1.0769 1.0871 1.0932 1.0921 1.0827 7.3251 8.5854 8.1785 1.0597 1.0635 1.0611 1.0595 1.0692 1.0598 1.0623 1.0630 1.0377 1.0625 1.0925 1.0980 1.0960 1.0982 1.1011 1.0988 1.1026 1.1042 1.1019 1.0978 1.0982 1.0964
irintensity: 1.0185 0.2058 0.4682 1.1910 0.1000 1.0867 0.5412 0.9700 2.2123 1.4619 0.9984 0.5963 2.6878 1.3496 1.9184 0.5362 2.7841 0.5611 3.0267 2.3766 0.7672 3.4016 6.7544 4.3785 3.9393 0.6115 3.8889 1.2517 10.4697 6.1450 0.2224 54.5255 5.0664 1.1834 11.6822 18.0994 0.9141 1.5120 8.8629 2.4421 4.8195 5.6317 6.7014 4.6931 8.9057 2.9511 19.9061 0.3087 0.7304 5.1624 2.7042 0.9024 22.2328 6.2267 0.3867 4.6259 1.5096 3.0626 4.9065 12.6524 6.1329 4.3853 8.2828 11.7411 18.9585 5.1926 5.9389 16.6864 3.2555 13.5433 0.9889 34.6388 0.7675 6.5072 25.0949 0.3675 46.3892 23.2320 2.4867 32.9253 17.3290 3.3588 12.1733 9.5636 9.7853 4.6702 9.3727 24.7000 11.5934 18.8084 3.7073 7.4269 57.3009 309.6069 138.3043 41.1282 45.4708 22.1275 32.7262 23.3916 39.3890 51.2860 22.5337 43.0944 56.9558 35.9090 18.5012 83.5048 33.7423 17.1271 66.5918 16.0143 61.9829 85.0335 19.8786 21.6840 4.7316
temp: 298.150 k
press: 1.00000 atm
elementType: 16 7 7 6 6 6 6 6 6 6 6 6 6 6 6 6 6 6 6 1 1 1 1 1 1 1 1 1 1 1 1 1 1 1 1 1 1 1 1 1 1
symmnumber: 1
zpe: 916422.7 jmol-1
zpe.correction: 0.349047 hartree
zpe.thermalcorrener: 0.366259 hartree
zpe.thermalcorrenthalpy: 0.367204 hartree
zpe.thermalcorrgfe: 0.305269 hartree
zpe.sumelectzpe: -1129.013377 hartree
zpe.sumelectthermal: -1128.996164 hartree
zpe.sumelectthermalent: -1128.995220 hartree
zpe.sumelectthermalfe: -1129.057154 hartree
dipole: 2.5153 3.2762 1.8099
dipole: 4.5095
quadrupole: -111.3893 -121.0196 -124.0205
quadrupole: -2.3499 2.8589 -3.2448
quadrupole: 7.4205 -2.2098 -5.2107 -2.3499 2.8589 -3.2448
hfenergy: -1129.3624237 hartree
pointgroup: C01 [X(C16H22N2S1)]
dipole: 1.0609757 1.2113285 0.7448008 debye
polarizability: 235.5174947|-17.8774356|214.7708914|9.1456771|9.4881543|138.9272127 unknown
InChI: InChI=1S/C16H22N2S/c1-12-11-19-15-17-16(9-5-2-6-10-16)13-7-3-4-8-14(13)18(12)15/h11H,2-10H2,1H3
charge 0 multiplicity 1
41 atoms
S  1.16114 -3.083658 -1.055404
N  -0.823944 -1.151015 -0.805721
N  1.414227 -0.62775 -0.010727
C  -1.312036 0.140762 -0.198905
C  -0.178423 1.186359 -0.180698
C  -1.778612 -0.143577 1.271314
C  -2.535496 0.59028 -1.04936
C  1.128623 0.789895 -0.053358
C  -2.955954 -1.14369 1.343018
C  -3.690073 -0.434723 -0.985544
C  -0.550214 2.65863 -0.281449
C  -4.1459 -0.675957 0.472553
C  2.3139 1.743237 -0.134841
C  0.6198 3.613514 0.036447
C  1.899447 3.129858 -0.673187
C  0.410786 -1.461814 -0.594798
C  2.642933 -1.291919 0.277709
C  2.680262 -2.576061 -0.199166
C  3.711037 -0.701126 1.166914
H  -2.084729 0.823415 1.723161
H  -0.914682 -0.516559 1.85446
H  -2.208625 0.730751 -2.097326
H  -2.904401 1.566407 -0.677999
H  -3.270987 -1.270324 2.397571
H  -2.611176 -2.130917 0.980671
H  -3.339634 -1.388315 -1.42223
H  -4.538434 -0.076339 -1.600753
H  -0.937627 2.874245 -1.298973
H  -1.395313 2.866545 0.406479
H  -4.957066 -1.429255 0.500729
H  -4.564646 0.264273 0.891272
H  2.7863 1.868094 0.859932
H  3.083498 1.304357 -0.799127
H  0.360835 4.642659 -0.275918
H  0.797085 3.640673 1.130471
H  2.729914 3.846121 -0.526595
H  1.710809 3.065277 -1.762859
H  3.47496 -3.301833 -0.046264
H  4.412099 -1.499214 1.462092
H  3.26942 -0.278103 2.08796
H  4.298795 0.093995 0.677245
