program: Gaussian 09
title: 000210631
version: EM64L-G09RevD.01
frameworkgroup: C1[X(C23H29NO3)]
method: RPBEPBE
basis: SDD
operation: Freq
keyword: #p
keyword: freq=noraman
keyword: PBEPBE/SDD
title: #p freq=noraman PBEPBE/SDD
converged: YES YES NO NO
title: Mulliken charges:
elementType: O O O N C C C C C C C C C C C C C C C C C C C C C C C H H H H H H H H H H H H H H H H H H H H H H H H H H H H H
charge: -0.244897 -0.470117 -0.254332 -0.117719 -0.013585 -0.441577 -0.486088 -0.443367 -0.428233 -0.360098 -0.402097 -0.321292 -0.679224 -0.110753 0.186758 0.426499 0.348118 -0.376191 -0.375421 -0.373664 -0.390303 -0.240505 -0.226679 -0.228535 -0.239670 -0.240142 -0.242217 0.194224 0.198636 0.215598 0.218872 0.212892 0.215456 0.209652 0.209207 0.215823 0.245516 0.211000 0.233202 0.223822 0.250478 0.240022 0.222111 0.218155 0.218269 0.368084 0.253257 0.284281 0.268691 0.263978 0.223321 0.227146 0.224226 0.224904 0.226376 0.228134
chargesum: 0.00000
title: Mulliken charges with hydrogens summed into heavy atoms:
elementType: O O O N C C C C C C C C C C C C C C C C C C C C C C C
charge: -0.244897 -0.102034 -0.254332 -0.117719 0.180639 -0.027343 -0.054324 -0.018259 -0.003203 0.096418 0.054927 0.169208 -0.020688 -0.110753 0.186758 0.426499 0.348118 -0.122934 -0.091140 -0.104973 -0.126326 -0.017184 0.000467 -0.004309 -0.014767 -0.013767 -0.014083
polarizability: 2.70241251e+02 -6.30153315e+00 2.61255168e+02 -1.10313823e+01 6.23923617e+00 2.42096203e+02
1716.lowfreq: -18.7526 -15.2351 -7.7810 -0.0011 -0.0004 0.0004 1.9061 4.2923 11.8672
frequency: -15.5890 -12.8857 8.5304 16.9995 32.5886 38.8394 42.2365 60.1269 69.0710 77.1970 82.3268 96.9589 115.1035 147.1254 166.3528 184.5323 202.7489 222.7171 241.7548 243.5176 255.4017 275.6568 297.6926 314.0264 327.2824 357.0662 367.2441 382.0881 390.0599 402.1368 407.0201 450.4621 465.8095 484.9364 512.9128 518.9433 548.8385 579.1966 595.6521 615.7725 616.2938 617.0760 663.3905 695.1786 702.4304 710.4827 725.6097 752.4521 764.7239 767.6971 781.9695 793.4581 809.9311 820.2067 853.0789 854.7169 864.2839 875.4418 895.7327 901.5929 915.2617 940.3306 941.0148 948.4264 951.0969 969.8211 980.4272 980.4979 987.6003 990.4620 990.8781 995.5888 1000.2936 1008.5414 1028.1847 1030.6699 1038.6404 1053.6245 1067.7620 1075.6229 1081.6768 1087.0732 1094.4114 1102.4148 1143.7028 1161.7746 1169.2535 1170.2819 1170.8735 1176.1782 1180.9652 1183.6382 1191.4874 1195.4585 1200.1740 1206.7977 1229.9729 1250.7408 1272.0370 1278.4332 1285.9479 1294.5614 1299.0865 1311.1407 1312.8411 1317.3466 1321.0513 1335.2942 1343.9963 1346.2514 1348.1613 1373.4177 1378.8011 1381.8215 1384.5075 1431.8572 1435.2679 1445.2189 1462.2684 1463.9630 1470.5225 1472.3138 1474.3055 1476.3357 1478.4256 1480.6436 1487.3614 1492.2498 1589.1958 1593.1182 1593.4105 1606.9575 1612.7524 2830.1289 2967.9158 2977.3697 2984.2196 2990.2575 2995.3299 2996.9390 3012.5853 3029.9508 3043.1267 3046.5573 3050.1429 3056.3386 3062.0553 3073.7419 3079.7842 3080.9755 3122.8774 3123.2210 3134.1573 3135.0707 3141.2281 3149.7947 3151.7258 3160.5972 3163.7111 3172.7378 3173.4548 3441.3981
redmass: 3.6639 3.0153 4.0059 4.9294 2.5073 4.0860 3.9042 4.1052 3.5653 6.0272 3.4345 2.8224 3.0389 4.0222 2.6384 3.6861 1.4662 4.6040 2.1143 3.2830 2.8633 5.1339 4.0992 5.8559 4.1122 2.8841 4.9936 2.7422 4.3873 2.8197 2.9194 1.3820 2.7940 2.4999 3.6912 2.7819 3.6063 5.0220 6.4779 6.3472 2.7762 6.3178 5.5660 6.1734 1.9102 1.8961 2.8179 1.2945 1.7759 1.7143 1.1811 1.7134 1.7932 2.0715 4.2047 1.3981 1.2493 2.8620 2.3629 3.5453 2.0738 1.8951 2.3456 1.4893 2.1294 1.7677 1.4948 1.4772 1.9162 5.3776 2.8470 1.3767 1.3240 5.2576 2.2075 2.1376 2.5585 3.1721 2.6712 1.8284 1.5886 2.0665 1.6959 2.7979 2.8264 1.4769 1.4832 1.1268 1.0695 1.9323 2.8831 1.3016 1.1697 1.7440 2.7467 1.5194 1.2699 1.4392 1.3494 1.1937 1.1487 1.3182 1.2884 1.3245 1.3377 1.3775 1.4417 1.4062 1.3652 1.2976 1.3908 1.3013 8.6135 9.1437 1.2463 2.2078 2.2366 1.1013 1.0800 1.0715 1.0706 1.0773 1.0577 2.1744 2.2257 1.0627 1.0854 1.0964 6.3055 7.8207 6.6848 6.0620 6.2471 1.0805 1.0587 1.0355 1.0595 1.0599 1.0626 1.0622 1.0660 1.1026 1.0996 1.1009 1.0602 1.1009 1.1033 1.0988 1.1022 1.1042 1.0848 1.0847 1.0892 1.0893 1.1087 1.0934 1.0940 1.0972 1.0957 1.0974 1.0969 1.0645
irintensity: 0.0372 0.0895 0.0623 0.0112 0.0453 0.0172 0.4917 0.1023 0.7492 1.0174 0.6763 0.3791 0.0509 0.3254 0.0243 1.4025 0.5247 1.6782 1.3069 0.3354 0.3453 1.2064 12.2542 1.4676 54.9009 4.3533 17.7216 10.7582 3.8742 0.5519 0.9535 65.2881 11.3561 15.1126 9.3126 2.3757 10.5711 4.3441 23.4636 0.4821 0.6133 0.2436 22.7685 6.6001 50.1882 46.6431 42.6498 10.7433 36.0832 30.4381 13.6586 4.8916 3.6457 0.1391 68.3764 13.1456 0.6644 0.3218 3.2577 10.6919 24.0421 6.4520 11.5187 2.4831 6.2662 1.3367 0.0069 0.2656 1.7695 0.6420 1.5624 5.2320 0.2577 94.9857 11.8588 11.9558 9.7047 9.8726 13.9239 15.1564 1.8467 33.4043 2.0083 22.3665 161.7988 3.5985 7.4420 11.6640 7.8486 47.3188 204.6845 19.0183 0.5409 3.2602 29.9096 6.8327 2.7264 19.1529 0.3568 1.6228 1.6227 3.3720 0.1857 1.6455 0.4346 2.2250 0.1926 27.3883 79.9782 6.2047 14.4160 9.0534 0.4433 0.6668 21.1786 6.4969 20.5536 7.8606 12.8396 10.4865 7.0371 9.9118 2.1311 22.1194 22.9800 8.0605 1.7972 14.3258 5.4373 98.8833 21.4720 9.0636 10.3791 70.4596 35.6487 26.5824 31.5216 33.1581 31.7492 48.1358 55.1410 11.7435 25.7893 10.6956 17.4636 11.6879 11.9931 49.6153 84.7072 81.4927 0.1861 0.0597 12.3467 18.0216 9.2997 28.2509 24.7378 15.7774 18.7538 14.4892 10.2123 55.5037
temp: 298.150 k
press: 1.00000 atm
elementType: 8 8 8 7 6 6 6 6 6 6 6 6 6 6 6 6 6 6 6 6 6 6 6 6 6 6 6 1 1 1 1 1 1 1 1 1 1 1 1 1 1 1 1 1 1 1 1 1 1 1 1 1 1 1 1 1
symmnumber: 1
zpe: 1231869.8 jmol-1
zpe.correction: 0.469194 hartree
zpe.thermalcorrener: 0.494098 hartree
zpe.thermalcorrenthalpy: 0.495042 hartree
zpe.thermalcorrgfe: 0.411118 hartree
zpe.sumelectzpe: -1172.229640 hartree
zpe.sumelectthermal: -1172.204736 hartree
zpe.sumelectthermalent: -1172.203792 hartree
zpe.sumelectthermalfe: -1172.287716 hartree
dipole: -3.4779 0.3154 1.8882
dipole: 3.9699
quadrupole: -157.4078 -152.9959 -158.0996
quadrupole: -1.4289 1.9272 2.4594
quadrupole: -1.2400 3.1718 -1.9318 -1.4289 1.9272 2.4594
hfenergy: -1172.6988343 hartree
pointgroup: C01 [X(C23H29N1O3)]
dipole: 1.2671947 -0.0258678 -0.9127214 debye
polarizability: 265.6316707|1.1260429|245.8806349|-10.7930991|-13.3556047|262.0803162 unknown
InChI: InChI=1S/C23H29NO3/c1-2-24(21-15-9-10-16-21)17-18-27-22(25)23(26,19-11-5-3-6-12-19)20-13-7-4-8-14-20/h3-8,11-14,21,26H,2,9-10,15-18H2,1H3
charge 0 multiplicity 1
56 atoms
O  0.097606 -0.416442 0.75447
O  -3.176894 0.707194 1.900303
O  -0.665865 1.549126 1.737973
N  3.321356 1.425383 -0.076023
C  4.273764 0.880199 -1.073989
C  4.333274 -0.670619 -1.093909
C  5.754079 1.248192 -0.79147
C  5.620671 -0.98235 -1.902001
C  6.584291 0.223276 -1.621988
C  1.914155 1.001073 -0.258583
C  3.474477 2.863581 0.266843
C  1.521058 0.059014 0.897136
C  3.228373 3.86662 -0.892586
C  -2.331313 -0.133378 1.045912
C  -0.883033 0.425076 1.214068
C  -2.424275 -1.577414 1.588874
C  -2.788773 -0.000735 -0.429832
C  -2.297008 -2.707351 0.747187
C  -4.137343 0.363022 -0.669951
C  -2.618325 -1.768371 2.979429
C  -1.937049 -0.257969 -1.533656
C  -2.355998 -4.010815 1.289448
C  -4.62539 0.470178 -1.990134
C  -2.676372 -3.071182 3.520353
C  -2.426899 -0.144438 -2.855252
C  -2.542616 -4.198926 2.677809
C  -3.771997 0.218622 -3.089585
H  4.0167 1.225042 -2.110241
H  4.434672 -1.021897 -0.048164
H  3.43559 -1.145085 -1.530384
H  6.001108 2.292929 -1.051021
H  5.939453 1.114352 0.292072
H  5.389806 -1.046599 -2.981616
H  6.062305 -1.95082 -1.608525
H  7.486397 -0.092824 -1.06879
H  6.931545 0.671829 -2.570437
H  1.232591 1.873186 -0.251553
H  1.768627 0.483349 -1.227714
H  4.489173 3.017494 0.675775
H  2.771262 3.081705 1.092969
H  2.109063 -0.869693 0.884792
H  1.625852 0.574781 1.866406
H  3.95544 3.723509 -1.712721
H  2.211454 3.757481 -1.313262
H  3.330653 4.905356 -0.526932
H  -2.70021 1.577352 2.014079
H  -2.164077 -2.576035 -0.330692
H  -4.782637 0.56784 0.188889
H  -2.751902 -0.891099 3.618759
H  -0.894837 -0.547486 -1.365107
H  -2.261455 -4.878188 0.626246
H  -5.670787 0.75167 -2.160455
H  -2.832097 -3.205825 4.596858
H  -1.756401 -0.341458 -3.699657
H  -2.590678 -5.210686 3.096373
H  -4.150263 0.305955 -4.114392
