program: Gaussian 09
title: 000210630
version: EM64L-G09RevD.01
frameworkgroup: C1[X(C23H29NO3)]
method: RPBEPBE
basis: SDD
operation: Freq
keyword: #p
keyword: freq=noraman
keyword: PBEPBE/SDD
title: #p freq=noraman PBEPBE/SDD
converged: NO YES NO NO
title: Mulliken charges:
elementType: O O O N C C C C C C C C C C C C C C C C C C C C C C C H H H H H H H H H H H H H H H H H H H H H H H H H H H H H
charge: -0.295122 -0.472222 -0.226268 -0.123113 0.015799 -0.459873 -0.431000 -0.405630 -0.406259 -0.386097 -0.388105 -0.671910 -0.298415 -0.143248 0.215413 0.386670 0.400368 -0.401869 -0.390797 -0.376698 -0.346725 -0.244142 -0.223447 -0.225257 -0.237920 -0.241515 -0.240935 0.176798 0.205013 0.210245 0.235545 0.195153 0.191153 0.198639 0.203645 0.189675 0.198053 0.191209 0.224268 0.242713 0.222262 0.196667 0.248955 0.257620 0.232046 0.264265 0.282311 0.277859 0.246834 0.372650 0.226415 0.223596 0.226743 0.223620 0.228702 0.225661
chargesum: 0.00000
title: Mulliken charges with hydrogens summed into heavy atoms:
elementType: O O O N C C C C C C C C C C C C C C C C C C C C C C C
charge: -0.295122 -0.099573 -0.226268 -0.123113 0.192597 -0.044615 -0.000302 -0.015838 -0.012938 0.003164 0.078876 -0.004026 0.191252 -0.143248 0.215413 0.386670 0.400368 -0.137603 -0.108486 -0.098839 -0.099891 -0.017727 0.000149 0.001486 -0.014299 -0.012813 -0.015274
polarizability: 2.75459676e+02 1.31652810e+01 2.61081915e+02 1.11406736e+01 3.34614462e+00 2.35908020e+02
1716.lowfreq: -20.2137 -8.3208 -4.1009 -0.0007 -0.0006 -0.0002 5.1495 12.6096 13.8564
frequency: -17.5018 11.1236 12.3287 24.9590 34.3994 37.7896 55.5383 62.8297 79.7359 107.0145 114.5709 142.8137 160.3019 201.8665 207.7852 221.2520 226.2396 233.6728 264.5192 270.2405 275.4265 291.6049 307.4643 337.2134 346.0890 360.1613 364.9423 382.9004 402.8189 405.1156 419.3555 432.6134 449.0467 466.6839 474.6914 484.8564 515.2154 553.2251 563.7134 603.2147 614.8179 616.4442 662.6488 696.2143 702.8797 709.1759 730.2355 758.4601 763.2517 767.7199 784.1532 794.9366 833.0313 840.0184 853.3881 861.8365 862.3259 890.2648 895.5052 899.0037 922.2102 925.3213 938.1113 949.8564 977.4530 981.1971 985.4411 989.2595 991.0852 998.3863 999.0560 1011.9845 1029.4457 1029.5799 1037.6379 1049.4757 1055.4178 1061.0762 1065.5306 1080.0534 1081.8035 1093.1682 1107.0951 1114.8503 1136.6629 1147.6592 1152.4343 1164.6808 1170.3496 1172.0264 1178.7486 1187.0717 1191.2972 1194.6784 1230.7012 1237.5500 1254.8951 1261.4755 1266.3529 1296.9518 1310.7300 1311.7428 1318.2970 1320.7082 1321.5368 1331.6668 1333.0474 1339.4086 1340.9511 1343.4574 1366.8960 1378.3729 1379.7683 1383.0852 1431.9445 1435.2183 1441.1462 1450.8006 1458.6034 1459.8328 1464.5149 1469.6534 1474.0902 1475.5186 1479.7717 1481.7705 1489.0281 1497.8887 1589.1816 1593.8210 1606.1222 1610.8735 1636.0618 2804.9859 2866.5010 2963.6582 2966.1041 2967.7772 2968.6654 2974.0051 2974.7607 3027.3889 3030.2179 3030.3193 3035.0890 3037.4571 3040.8336 3047.6023 3051.6640 3087.2235 3122.4381 3123.3675 3131.5155 3134.9657 3135.7210 3143.5868 3152.5544 3157.8833 3166.3434 3170.6135 3181.2703 3526.7410
redmass: 3.2654 4.0733 4.6033 4.7753 3.7597 4.0479 4.5683 4.8997 4.5290 2.9432 4.5360 5.4762 3.6986 1.7653 3.9700 4.7835 2.0150 3.5805 2.0031 2.7208 4.2579 5.2938 2.1868 3.2541 2.8243 2.3951 3.2001 3.4205 2.8509 2.9790 1.9091 2.9657 2.5259 2.4261 3.8062 2.1347 3.0117 6.9425 2.6600 6.0436 6.4005 6.4105 5.6694 5.7479 2.0236 1.8760 2.9002 1.8132 1.8367 2.3427 1.4623 1.5622 3.8967 3.4929 1.2687 1.5413 1.4135 1.8932 1.4967 3.6122 2.1435 2.1697 1.6633 2.8147 2.4211 1.3949 1.4899 4.6740 5.7295 1.3606 1.3213 5.3394 2.1905 2.2097 2.1709 1.3064 1.9886 2.4086 1.8531 1.5355 1.6039 1.7997 1.5882 1.9513 5.0178 2.2660 2.5426 1.6946 1.1302 1.0738 2.1789 1.5185 1.2897 1.1471 2.1125 1.3534 1.2921 1.3058 1.3166 1.1610 1.2791 1.3394 1.3329 1.2950 1.3585 1.4505 1.4153 1.4914 1.5211 1.4998 1.3521 8.3677 1.3885 8.5281 2.2014 2.2291 1.1505 1.0987 1.0867 1.0889 1.0861 1.0870 1.0693 2.1281 2.2263 1.0756 1.0757 1.0581 6.2053 6.3560 5.9909 6.1003 10.5998 1.0800 1.0565 1.0640 1.0652 1.0622 1.0601 1.0621 1.0583 1.0962 1.0951 1.0959 1.0850 1.0993 1.1004 1.1021 1.0584 1.0994 1.0848 1.0848 1.0883 1.1103 1.0896 1.0936 1.0947 1.0972 1.0971 1.0978 1.0950 1.0647
irintensity: 0.2173 0.0638 0.0411 0.3253 0.2135 0.8510 0.7027 0.7228 0.6775 0.8909 1.1172 0.4627 2.2830 0.0876 0.3324 2.7168 1.8069 2.7757 1.5926 3.1828 2.0299 9.8196 6.8557 59.0624 1.6016 16.0391 21.6004 4.5447 1.8725 2.1929 80.4667 1.5313 0.8315 2.1624 6.5105 1.3390 8.1726 1.8454 11.5224 28.8070 0.1971 0.3491 19.9772 11.8825 42.0678 54.2042 18.0619 30.1846 55.1991 6.7318 0.9036 1.7285 7.8520 44.9367 0.5210 6.7151 3.5956 2.1901 6.6850 5.9769 90.5718 3.7719 4.2668 79.8866 10.9766 0.3193 0.7297 1.3831 0.6668 3.4977 0.1255 55.2278 16.3255 8.5355 45.7927 2.1100 11.0094 28.8806 13.7893 21.2256 0.6012 34.0780 6.7325 3.6503 332.6560 1.4658 46.4660 13.1586 2.7477 1.1892 14.0051 4.4468 2.9056 0.7242 15.2772 4.0559 3.1300 3.4123 7.2066 1.4616 2.4103 4.1675 0.9007 0.5832 0.6618 10.0468 68.6454 9.2327 7.3781 1.1717 22.0496 0.0675 2.5149 0.9326 4.5906 30.0656 5.1093 8.3781 1.8070 15.8810 11.0121 14.4517 9.9400 25.3436 16.2322 4.2749 9.2838 15.4768 0.8710 0.0485 8.7383 3.5577 86.6254 66.7643 132.4232 38.7928 36.7237 38.0988 8.1262 31.0106 37.2204 80.7540 14.9006 50.6188 47.1045 12.5231 20.9386 96.5497 38.3601 38.5017 0.5437 0.3354 6.9699 11.3153 17.4694 20.8852 38.7466 23.0199 13.3190 14.8968 7.9055 47.9163
temp: 298.150 k
press: 1.00000 atm
elementType: 8 8 8 7 6 6 6 6 6 6 6 6 6 6 6 6 6 6 6 6 6 6 6 6 6 6 6 1 1 1 1 1 1 1 1 1 1 1 1 1 1 1 1 1 1 1 1 1 1 1 1 1 1 1 1 1
symmnumber: 1
zpe: 1235182.8 jmol-1
zpe.correction: 0.470456 hartree
zpe.thermalcorrener: 0.495544 hartree
zpe.thermalcorrenthalpy: 0.496489 hartree
zpe.thermalcorrgfe: 0.412315 hartree
zpe.sumelectzpe: -1172.231872 hartree
zpe.sumelectthermal: -1172.206784 hartree
zpe.sumelectthermalent: -1172.205840 hartree
zpe.sumelectthermalfe: -1172.290013 hartree
dipole: 2.6946 2.0070 0.0828
dipole: 3.3609
quadrupole: -156.0228 -153.9805 -153.7928
quadrupole: 2.5567 -2.0989 0.8372
quadrupole: -1.4241 0.6182 0.8059 2.5567 -2.0989 0.8372
hfenergy: -1172.7023284 hartree
pointgroup: C01 [X(C23H29N1O3)]
dipole: 1.2579199 -0.1785107 -0.3663054 debye
polarizability: 285.3287141|1.5097504|233.1538453|-3.7916886|-1.7173697|253.9670525 unknown
InChI: InChI=1S/C23H29NO3/c1-24(21-15-9-4-10-16-21)17-18-27-22(25)23(26,19-11-5-2-6-12-19)20-13-7-3-8-14-20/h2-3,5-8,11-14,21,26H,4,9-10,15-18H2,1H3
charge 0 multiplicity 1
56 atoms
O  -0.196463 -1.531017 -0.738034
O  -2.512583 -1.175678 -1.81723
O  -0.325109 0.292306 0.707569
N  3.5023 -1.840196 0.084133
C  4.167668 -0.947093 1.085661
C  5.465233 -1.579127 1.647539
C  3.198192 -0.625154 2.25516
C  6.126232 -0.674114 2.715861
C  3.855004 0.288698 3.316415
C  5.15386 -0.339538 3.869055
C  2.291055 -1.251777 -0.539295
C  4.391226 -2.489886 -0.902887
C  1.045782 -2.010329 -0.040459
C  -2.01155 0.018662 -1.130133
C  -0.778247 -0.359723 -0.256579
C  -1.568004 1.080208 -2.175824
C  -3.152707 0.535748 -0.227767
C  -0.545722 2.029992 -1.929411
C  -4.255662 -0.303775 0.059066
C  -2.252127 1.105746 -3.416985
C  -3.097867 1.831145 0.341156
C  -0.209511 2.986612 -2.915004
C  -5.294602 0.150668 0.902493
C  -1.917282 2.064193 -4.396923
C  -4.133861 2.280427 1.188263
C  -0.892854 3.008615 -4.151196
C  -5.237337 1.442711 1.472118
H  4.452542 0.026427 0.599555
H  5.211797 -2.563345 2.092655
H  6.19419 -1.761101 0.836244
H  2.273919 -0.145587 1.88112
H  2.902763 -1.586896 2.722571
H  6.45924 0.270639 2.237351
H  7.035483 -1.169963 3.10745
H  3.135815 0.47991 4.135624
H  4.08943 1.274071 2.862029
H  5.637718 0.344853 4.592593
H  4.904306 -1.269654 4.420269
H  2.33852 -1.32871 -1.643254
H  2.190154 -0.175882 -0.297606
H  3.780774 -3.110858 -1.58232
H  4.973399 -1.768423 -1.528912
H  5.104911 -3.164857 -0.402995
H  0.910185 -1.878976 1.04523
H  1.101845 -3.079362 -0.294906
H  -0.010314 2.02996 -0.9733
H  -4.2911 -1.297803 -0.393384
H  -3.036361 0.364932 -3.598999
H  -2.253354 2.491621 0.123849
H  -1.725433 -1.735702 -2.048789
H  0.58541 3.713761 -2.713858
H  -6.14703 -0.505148 1.113647
H  -2.455356 2.075121 -5.351659
H  -4.080621 3.284504 1.623913
H  -0.631616 3.751114 -4.913593
H  -6.042676 1.794329 2.127117
