program: Gaussian 09
title: 000210627
version: EM64L-G09RevD.01
frameworkgroup: C1[X(C20H27N3O3)]
method: RPBEPBE
basis: SDD
operation: Freq
keyword: #p
keyword: freq=noraman
keyword: PBEPBE/SDD
title: #p freq=noraman PBEPBE/SDD
converged: YES YES NO NO
title: Mulliken charges:
elementType: O O O N N N C C C C C C C C C C C C C C C C C C C C H H H H H H H H H H H H H H H H H H H H H H H H H H H
charge: -0.441596 -0.230010 -0.266454 -0.280620 -0.099573 -0.094835 0.021282 0.231918 -0.524531 -0.494082 -0.452606 0.134515 -0.296143 0.407056 0.213282 -0.348632 -0.394924 -0.356714 -0.307636 -0.315341 -0.391277 -0.231481 -0.204364 -0.247836 -0.696435 -0.681356 0.233606 0.244824 0.237596 0.234729 0.224570 0.227356 0.270825 0.249276 0.293012 0.214024 0.236457 0.244558 0.228448 0.362149 0.190215 0.207302 0.221669 0.223326 0.225310 0.229695 0.230244 0.214222 0.216110 0.229031 0.217905 0.220951 0.220986
chargesum: 0.00000
title: Mulliken charges with hydrogens summed into heavy atoms:
elementType: O O O N N N C C C C C C C C C C C C C C C C C C C C
charge: -0.079447 -0.230010 -0.266454 -0.280620 -0.099573 -0.094835 0.021282 0.231918 -0.046101 -0.021757 -0.000681 0.134515 -0.025318 0.407056 0.213282 -0.099356 -0.101912 0.093767 0.165369 0.082176 0.053718 -0.006171 0.025331 -0.017592 -0.037072 -0.021514
polarizability: 2.74356835e+02 5.31031940e+01 2.47602134e+02 -7.19557673e+00 2.03051174e+01 2.32731963e+02
1716.lowfreq: -3.5910 -0.0005 0.0003 0.0003 3.3528 7.4276 11.4459 16.4275 18.9093
frequency: 10.9580 16.2894 18.6629 33.2494 39.4380 47.5221 53.0086 61.5779 72.5090 88.8182 97.5892 105.7255 135.0431 146.3224 160.2616 173.9556 207.7561 209.4023 224.2643 231.2673 249.2694 271.0944 280.0548 291.3039 298.6067 309.5578 329.7301 371.6663 391.8259 399.0137 407.7639 408.7607 459.1692 484.0882 512.7582 533.2933 542.3672 590.8176 612.0758 615.3869 639.1169 654.8987 683.2594 694.8716 707.4336 719.3929 741.1745 763.3917 766.6143 771.9049 796.5142 807.2675 830.2794 839.9902 853.5221 854.4441 897.3813 898.8971 900.1284 916.3706 917.6774 974.0910 974.7138 984.9439 987.2646 996.1378 1005.7981 1019.1666 1034.1997 1036.5198 1045.8462 1050.9200 1062.1583 1070.6138 1075.1744 1088.3620 1096.0073 1117.1619 1136.2107 1157.7622 1171.5102 1176.4937 1184.5422 1185.4217 1191.1829 1200.7705 1203.8420 1236.5697 1245.4116 1247.6165 1268.2833 1277.5756 1281.9913 1290.7633 1294.4072 1318.4840 1319.9689 1325.4636 1334.3940 1341.8718 1368.3441 1371.0794 1371.6339 1375.4049 1381.9686 1388.1792 1388.3045 1433.6885 1448.1585 1453.9290 1458.1077 1462.4650 1466.9112 1471.6517 1474.3442 1478.5059 1482.1546 1483.1670 1490.9636 1497.6977 1499.8786 1503.2438 1553.6520 1598.8756 1607.2273 1614.5794 2866.4612 2921.0112 2973.1217 2977.1837 2984.0367 2986.7820 2995.8900 3010.4654 3010.6254 3037.7492 3042.9008 3047.8995 3048.7253 3049.2554 3073.5787 3079.0898 3081.3381 3082.1522 3087.5815 3090.4783 3131.2004 3131.5430 3142.0378 3162.3560 3181.8861 3188.7504 3479.5097
redmass: 4.9641 3.9884 3.4656 3.6472 4.1731 4.0986 2.6681 5.5324 3.5154 3.8938 5.5042 3.3140 3.6241 2.2621 1.5893 2.6950 3.7211 1.3755 3.9988 2.1395 3.7176 2.0322 4.8166 2.5542 2.5850 4.5055 3.9552 5.8876 1.2144 2.6660 2.8884 3.4973 3.9537 2.8142 3.2574 3.6610 4.4274 4.8393 6.5305 5.8008 5.3977 6.6037 4.2554 1.9397 2.5782 4.3824 2.8357 4.7557 1.7625 1.1331 1.2872 1.2388 2.3057 1.3221 5.8026 5.2074 1.8105 2.0007 2.0236 1.4925 4.4393 2.5173 1.3653 5.4926 6.0351 1.3190 2.9876 2.9520 3.5342 2.7509 1.8831 2.6249 2.4419 1.9756 2.2007 2.1349 1.6836 1.6423 1.1863 2.6117 1.0546 2.1646 1.6930 1.2977 1.3073 1.4056 2.0652 1.4530 2.0651 1.5280 1.4428 1.1338 1.3781 1.1844 2.1059 1.5255 1.3116 1.4977 1.3405 1.2250 1.3229 1.3518 3.8235 1.2874 1.2913 1.2731 8.7091 3.3629 1.0985 2.7799 1.0615 1.1126 1.0496 1.0913 1.0480 1.0620 1.1237 1.1210 1.0760 3.5844 1.0760 5.3743 6.1750 6.8671 8.5325 6.1566 1.0712 1.0687 1.0632 1.0351 1.0648 1.0359 1.0616 1.0679 1.0853 1.0959 1.0991 1.0956 1.0754 1.0760 1.0989 1.1006 1.1047 1.0995 1.0858 1.1005 1.0853 1.1098 1.0906 1.0965 1.0941 1.0958 1.0651
irintensity: 0.0949 0.2975 0.0385 0.2909 0.3929 1.3212 1.0873 0.3662 0.2253 0.8424 2.8445 0.1843 5.1613 1.1085 0.2859 4.1200 1.6242 0.3736 0.3144 0.9491 3.0637 0.5254 0.3904 6.7844 10.4513 7.6865 52.6113 2.3298 146.9821 4.9505 0.0891 0.7090 7.4455 13.0623 11.7142 12.6205 1.9032 10.6662 27.6124 4.4815 8.7843 9.0337 19.4169 43.8258 1.0622 5.0880 6.1305 6.3805 65.3597 5.6462 3.9068 8.9262 2.4907 2.0107 27.3432 7.0901 4.4490 2.2502 3.6460 12.6363 53.9728 14.0834 0.3850 151.5414 1.8502 2.4534 6.7955 20.8439 25.0984 16.5131 5.4573 9.6087 2.3904 9.2783 60.6702 33.0579 15.2082 5.9280 2.7686 216.7623 0.1658 9.3341 21.8721 0.9784 3.5553 7.7715 29.3516 149.3303 24.9865 28.9838 37.7435 8.0172 5.6309 5.3585 15.5264 0.5683 7.3581 7.5496 8.2531 9.2745 22.0029 4.5452 67.7503 35.3891 7.7330 24.5823 5.8052 10.9449 11.1917 5.2853 18.8800 6.2290 15.1418 7.4243 5.2237 10.6305 9.4827 3.6187 11.8083 151.4388 1.4034 46.8128 14.9171 4.9848 145.7283 77.7477 78.8657 56.8473 33.9141 23.8684 36.1586 28.0022 41.6857 21.2512 35.0823 19.2701 5.9892 22.8676 9.9883 33.2555 45.9351 81.3279 43.5801 36.6935 6.8602 39.4923 0.8454 11.6232 17.7647 36.6215 7.9304 2.4018 29.3039
temp: 298.150 k
press: 1.00000 atm
elementType: 8 8 8 7 7 7 6 6 6 6 6 6 6 6 6 6 6 6 6 6 6 6 6 6 6 6 1 1 1 1 1 1 1 1 1 1 1 1 1 1 1 1 1 1 1 1 1 1 1 1 1 1 1
symmnumber: 1
zpe: 1155258.2 jmol-1
zpe.correction: 0.440015 hartree
zpe.thermalcorrener: 0.466439 hartree
zpe.thermalcorrenthalpy: 0.467383 hartree
zpe.thermalcorrgfe: 0.378781 hartree
zpe.sumelectzpe: -1166.251288 hartree
zpe.sumelectthermal: -1166.224864 hartree
zpe.sumelectthermalent: -1166.223920 hartree
zpe.sumelectthermalfe: -1166.312522 hartree
dipole: 0.7120 -3.5068 4.0232
dipole: 5.3843
quadrupole: -143.1673 -159.2007 -148.0419
quadrupole: 0.8655 -8.1074 10.8859
quadrupole: 6.9693 -9.0640 2.0947 0.8655 -8.1074 10.8859
hfenergy: -1166.691303 hartree
pointgroup: C01 [X(C20H27N3O3)]
dipole: 0.2874587 -1.7054809 -1.2231612 debye
polarizability: 262.6108776|-38.0405616|238.9963535|15.2446894|-43.6843422|253.0837012 unknown
InChI: InChI=1S/C20H27N3O3/c1-3-22(4-2)13-14-26-20(25)19(24)18-16-11-8-12-17(16)23(21-18)15-9-6-5-7-10-15/h5-7,9-10,19,24H,3-4,8,11-14H2,1-2H3
charge 0 multiplicity 1
53 atoms
O  0.008124 3.913731 1.025677
O  -2.368044 1.206743 0.750883
O  -1.688782 2.772109 -0.846178
N  2.263567 0.008285 1.379443
N  1.172901 0.704324 1.940628
N  -4.113952 -0.955828 -1.818824
C  1.558551 1.422866 -0.217372
C  2.496342 0.435069 0.076611
C  1.784329 2.001935 -1.594803
C  3.470765 0.181262 -1.047474
C  2.768628 0.949541 -2.231015
C  0.76082 1.564776 0.959619
C  -0.385313 2.51618 1.220451
C  2.934048 -0.980511 2.165866
C  -1.544303 2.192854 0.262349
C  4.148663 -1.556506 1.716176
C  2.376593 -1.375576 3.407567
C  -2.961893 -0.33601 -1.126084
C  -3.477487 0.73627 -0.146257
C  -4.660946 -2.132406 -1.096217
C  -3.942756 -1.117114 -3.284135
C  4.792318 -2.534256 2.504329
C  3.033099 -2.350233 4.185727
C  4.240907 -2.938682 3.74083
C  -6.070122 -2.537229 -1.566103
C  -2.908042 -2.183866 -3.735987
H  2.253119 3.00371 -1.530002
H  0.860872 2.116032 -2.189814
H  3.617947 -0.886944 -1.289673
H  4.467636 0.611703 -0.822832
H  3.503369 1.418877 -2.907921
H  2.183141 0.224087 -2.824605
H  -0.717098 2.40764 2.26462
H  4.601287 -1.24237 0.772783
H  1.446353 -0.908018 3.737248
H  -2.345186 -1.074425 -0.564462
H  -2.299006 0.148594 -1.865115
H  -3.894969 1.598057 -0.692613
H  -4.220934 0.32409 0.552629
H  -0.187524 4.144811 0.075983
H  -3.977724 -3.016253 -1.160698
H  -4.712327 -1.86388 -0.023545
H  -3.653961 -0.129975 -3.692075
H  -4.929204 -1.353857 -3.723438
H  5.731635 -2.974476 2.151655
H  2.597762 -2.651509 5.144884
H  4.7453 -3.696157 4.349969
H  -6.471135 -3.336357 -0.916119
H  -6.069426 -2.922323 -2.601652
H  -6.752997 -1.670476 -1.520511
H  -2.833303 -2.199625 -4.839292
H  -3.195756 -3.198137 -3.404073
H  -1.902684 -1.964045 -3.331142
