program: Gaussian 09
title: 000216010
version: EM64L-G09RevD.01
frameworkgroup: C1[X(C12H15NS)]
method: RPBEPBE
basis: SDD
operation: Freq
keyword: #p
keyword: freq=noraman
keyword: PBEPBE/SDD
title: #p freq=noraman PBEPBE/SDD
converged: YES YES NO NO
title: Mulliken charges:
elementType: S N C C C C C C C C C C C C H H H H H H H H H H H H H H H
charge: 0.190919 -0.486292 0.057908 -0.546457 -0.468470 -0.373339 -0.392483 -0.397573 0.549919 -0.305463 -0.423922 -0.292477 -0.213580 -0.267119 0.242658 0.291631 0.196002 0.215205 0.220105 0.214230 0.199111 0.206587 0.201020 0.204913 0.284553 0.211548 0.234539 0.221194 0.225134
chargesum: 0.00000
title: Mulliken charges with hydrogens summed into heavy atoms:
elementType: S N C C C C C C C C C C C C
charge: 0.190919 -0.201738 0.300567 -0.254827 -0.057263 0.060996 0.013214 0.008359 0.549919 -0.305463 -0.212373 -0.057938 0.007613 -0.041985
polarizability: 2.17862357e+02 3.06886491e-01 1.48083387e+02 2.88582862e+00 2.34827346e+00 8.44214325e+01
1716.lowfreq: -5.2293 0.0022 0.0025 0.0029 15.6534 17.6772 37.2196 97.5757 154.6335
frequency: 36.8405 97.4765 154.6295 183.7795 202.9124 247.9487 298.6174 321.3715 339.1641 346.0718 371.5042 396.2564 409.4927 442.4756 456.2161 490.5757 538.9331 589.1223 637.0804 661.1378 714.7020 723.7040 744.2980 791.6156 829.8829 836.9291 844.2480 867.6112 896.6555 923.9832 955.9050 957.9637 960.7978 1027.4574 1044.5884 1056.0741 1064.3672 1102.0210 1112.2225 1115.1589 1128.8769 1144.0032 1168.8055 1198.2691 1209.1676 1242.4009 1260.1953 1260.7249 1285.1601 1294.3426 1315.2953 1331.1625 1336.2086 1339.9286 1346.2897 1355.1068 1380.8632 1419.2410 1463.3946 1465.9675 1469.6986 1475.5198 1483.2042 1494.5198 1581.4726 1607.3210 2911.7456 2965.5736 2976.1550 2976.8867 2982.2379 3023.5877 3029.7385 3038.2430 3044.9093 3055.8653 3105.8807 3127.8233 3140.0467 3165.2715 3550.1428
redmass: 5.0345 3.0149 4.0482 2.7837 4.2320 4.0358 3.4551 2.2718 2.6599 3.3961 4.0788 1.7231 3.0229 3.1054 3.1786 2.4037 3.7378 4.7338 3.6271 6.5614 2.9522 3.1706 1.3762 2.0890 4.5191 1.4698 1.8523 1.6503 2.0062 1.3738 2.3976 1.3139 2.0584 4.7057 2.3630 1.4338 1.7604 2.1786 2.2579 2.0361 2.1119 1.6135 1.0593 1.3067 1.5200 1.3064 1.3568 1.3126 1.7301 1.3267 1.2442 1.4294 1.4389 1.4156 1.5015 1.5805 3.8264 2.3488 1.0913 1.0932 1.0825 1.0986 2.2229 2.2613 5.0732 6.7981 1.0822 1.0591 1.0639 1.0635 1.0623 1.0968 1.0907 1.0965 1.1014 1.1015 1.0877 1.0874 1.0931 1.1002 1.0762
irintensity: 0.7710 0.1680 0.6612 2.2077 0.5256 4.7002 2.0455 0.4020 2.9096 4.1499 8.9712 56.5204 25.9204 1.1334 1.9035 0.8265 1.3675 1.4786 3.3634 9.3868 8.0261 1.5861 100.9492 3.4228 1.7079 2.9175 12.7177 4.8645 4.7942 3.1707 2.9822 0.0882 9.8285 32.2813 6.6370 0.5582 2.2669 1.1747 0.4532 16.1276 6.9519 2.1083 1.3378 5.2395 7.4026 7.1764 2.9822 4.0312 16.6384 1.9510 3.8347 0.5346 11.1130 2.6882 10.5741 92.6167 21.6453 2.7244 4.3088 3.9106 19.7619 12.5245 52.7109 158.5002 0.9111 74.6206 46.9417 38.0620 35.4557 33.2505 14.9884 37.6214 12.4217 62.6697 28.4286 81.3721 15.5958 0.5477 26.5512 31.0190 17.1578
temp: 298.150 k
press: 1.00000 atm
elementType: 16 7 6 6 6 6 6 6 6 6 6 6 6 6 1 1 1 1 1 1 1 1 1 1 1 1 1 1 1
symmnumber: 1
zpe: 639661.4 jmol-1
zpe.correction: 0.243634 hartree
zpe.thermalcorrener: 0.255588 hartree
zpe.thermalcorrenthalpy: 0.256533 hartree
zpe.thermalcorrgfe: 0.205667 hartree
zpe.sumelectzpe: -918.063291 hartree
zpe.sumelectthermal: -918.051337 hartree
zpe.sumelectthermalent: -918.050393 hartree
zpe.sumelectthermalfe: -918.101258 hartree
dipole: -2.9220 2.3504 0.1931
dipole: 3.7550
quadrupole: -83.7376 -86.1021 -95.1635
quadrupole: -0.1700 0.2875 -0.8640
quadrupole: 4.5968 2.2323 -6.8291 -0.1700 0.2875 -0.8640
hfenergy: -918.3069254 hartree
pointgroup: C01 [X(C12H15N1S1)]
dipole: -1.1436102 0.9303856 0.0948167 debye
polarizability: 217.859803|-0.2100084|147.9565792|2.9788675|3.6627938|84.5507941 unknown
InChI: InChI=1S/C12H15NS/c1-3-7-11-9(5-1)13-10-6-2-4-8-12(10)14-11/h1,3,5,7,10,12-13H,2,4,6,8H2
charge 0 multiplicity 1
29 atoms
S  0.016013 -1.914287 -0.306179
N  0.024614 1.265811 -0.095091
C  -1.252986 0.608468 -0.401284
C  -1.364256 -0.760342 0.306383
C  -2.418688 1.527293 0.043683
C  -2.718799 -1.431904 0.012582
C  -3.789276 0.873202 -0.242769
C  -3.892378 -0.513906 0.435318
C  1.279062 0.643876 -0.04377
C  1.445138 -0.774005 -0.103598
C  2.448894 1.44779 0.095644
C  2.735142 -1.343644 -0.027163
C  3.731786 0.87203 0.158939
C  3.885397 -0.53307 0.093491
H  -1.354408 0.418722 -1.494827
H  -1.218024 -0.624204 1.393327
H  -2.339954 2.500705 -0.482593
H  -2.315116 1.731351 1.128607
H  -2.777363 -2.401652 0.541576
H  -2.787714 -1.64865 -1.072502
H  -3.922309 0.757108 -1.337798
H  -4.602314 1.535021 0.110673
H  -3.881736 -0.385533 1.536851
H  -4.853485 -0.997601 0.177302
H  0.021096 2.286304 -0.099455
H  2.335072 2.538821 0.147242
H  2.835716 -2.434839 -0.059227
H  4.609521 1.520113 0.260125
H  4.877959 -0.991677 0.14441
