program: Gaussian 09
title: 000216032
version: EM64L-G09RevD.01
frameworkgroup: C1[X(C14H20N2OS)]
method: RPBEPBE
basis: SDD
operation: Freq
keyword: #p
keyword: freq=noraman
keyword: PBEPBE/SDD
title: #p freq=noraman PBEPBE/SDD
converged: YES YES NO NO
title: Mulliken charges:
elementType: S O N N C C C C C C C C C C C C C C H H H H H H H H H H H H H H H H H H H H
charge: 0.174820 -0.404750 -0.157935 -0.097966 0.341777 -0.456661 -0.324143 0.322020 -0.463687 -0.328948 -0.423722 -0.622332 -0.315651 -0.247737 -0.606435 -0.628330 -0.269388 -0.236844 0.242381 0.215045 0.178539 0.234396 0.240951 0.212701 0.221683 0.257845 0.251740 0.313704 0.254481 0.228139 0.193025 0.220618 0.262120 0.216796 0.184534 0.227109 0.227124 0.362980
chargesum: 0.00000
title: Mulliken charges with hydrogens summed into heavy atoms:
elementType: S O N N C C C C C C C C C C C C C C
charge: 0.174820 -0.041770 -0.157935 -0.097966 0.341777 0.000766 0.088792 0.322020 -0.010035 -0.107266 -0.423722 -0.112747 -0.001947 0.006744 0.035347 0.035120 -0.042278 -0.009720
polarizability: 2.11482191e+02 8.29755593e+00 2.12823754e+02 4.33595641e+00 6.99748764e+00 1.34440374e+02
1716.lowfreq: -12.0313 -0.0016 -0.0012 -0.0005 5.0166 8.4694 20.8460 47.1065 67.2849
frequency: 20.2188 47.0365 67.2281 77.4248 104.6858 112.0262 126.9118 147.5566 162.1958 185.9752 221.8457 238.5569 253.7140 282.6759 293.9585 311.1940 321.2364 329.1094 352.5670 371.5868 390.3186 404.0231 418.5678 447.4875 475.5684 513.2031 530.3481 555.9199 566.8947 604.2603 624.6751 654.1677 712.6334 740.6841 752.4930 774.6602 795.7407 818.3641 868.9479 892.2861 895.8928 913.3089 928.8877 973.1807 997.4162 1015.3911 1019.9568 1027.4601 1037.3781 1045.6719 1055.2363 1065.1132 1082.6220 1094.9534 1122.7906 1136.5127 1147.0722 1154.0817 1175.6396 1182.4104 1203.4937 1237.9349 1256.1753 1277.9844 1279.4014 1285.4250 1299.1112 1309.2141 1326.4532 1349.4415 1357.1662 1370.2714 1370.9076 1413.6046 1418.1696 1436.6330 1444.0153 1450.1255 1459.1963 1460.5573 1464.8669 1470.1290 1472.7767 1483.5016 1490.3352 1558.5460 1593.4655 1623.3426 2812.6470 2851.5350 2865.6471 2978.8819 3009.3688 3010.3134 3014.2672 3018.1662 3036.1470 3036.7125 3077.1731 3084.8258 3088.5027 3088.5663 3097.4223 3121.1011 3126.1841 3143.7484 3161.4375 3504.8729
redmass: 4.2013 4.0157 3.1122 4.4569 3.7830 3.2162 3.9953 3.0303 4.4337 4.1489 1.5204 1.2266 2.0238 2.7360 2.9669 2.1503 4.1587 2.0424 2.2366 2.4539 2.7860 8.1416 2.1603 3.5277 3.3041 3.6249 3.6818 3.8878 2.9724 4.1841 3.6635 6.1697 4.9811 3.2400 4.5012 1.2568 1.5073 2.9772 1.9665 2.1598 1.5079 2.0750 2.7586 1.3470 2.6531 2.0858 1.8089 2.6106 1.5857 2.4271 2.1059 1.8068 1.6518 1.6441 1.9456 1.5027 2.1127 1.3914 1.0894 1.4176 2.0088 1.6690 2.0557 1.4756 1.4647 1.1902 1.4372 1.2583 1.4367 3.1317 1.3661 1.6482 2.0261 2.0941 1.1429 1.1502 1.0952 1.0796 1.0691 1.1577 1.0841 1.8694 1.1333 1.0537 1.0517 6.1550 5.5758 8.0062 1.0707 1.0564 1.0567 1.0598 1.0655 1.0585 1.0861 1.0727 1.0993 1.0743 1.1012 1.0970 1.1010 1.1025 1.0993 1.0906 1.0868 1.0930 1.0993 1.0683
irintensity: 0.3519 0.3421 0.0523 1.1803 1.5727 1.0236 0.8417 0.1110 1.6797 1.7101 0.6346 0.4678 5.5322 0.6098 4.4898 39.4556 10.0151 97.7318 6.7546 4.2808 3.1280 0.4659 2.5690 10.1140 1.3061 3.4031 10.0769 5.5788 4.6727 3.1338 9.9783 2.9414 5.9243 36.6489 1.1626 75.0534 34.0734 14.3168 1.6279 4.8594 4.3138 5.0804 17.8113 1.7564 2.7285 7.4390 5.3429 12.3193 15.7349 24.9036 14.4914 14.3603 3.1840 6.2500 2.0952 5.1225 27.3930 4.5500 0.8571 7.0813 8.3168 43.4420 3.5228 13.6019 4.2837 9.1925 8.8492 39.1961 6.8687 1.7198 14.7646 15.9922 25.7048 11.0961 3.0580 9.8501 5.6345 14.6506 6.5990 8.1100 27.7469 17.7008 13.5237 4.2688 22.6444 1.8664 2.5101 52.2599 100.7071 68.7410 301.8754 30.7253 41.1705 65.1783 15.1336 32.5534 25.4283 26.9071 25.8806 21.1294 22.7075 49.3293 20.3783 29.7806 0.9782 17.4085 32.1996 10.6239
temp: 298.150 k
press: 1.00000 atm
elementType: 16 8 7 7 6 6 6 6 6 6 6 6 6 6 6 6 6 6 1 1 1 1 1 1 1 1 1 1 1 1 1 1 1 1 1 1 1 1
symmnumber: 1
zpe: 825002.7 jmol-1
zpe.correction: 0.314227 hartree
zpe.thermalcorrener: 0.332772 hartree
zpe.thermalcorrenthalpy: 0.333716 hartree
zpe.thermalcorrgfe: 0.267577 hartree
zpe.sumelectzpe: -1126.803050 hartree
zpe.sumelectthermal: -1126.784505 hartree
zpe.sumelectthermalent: -1126.783561 hartree
zpe.sumelectthermalfe: -1126.849700 hartree
dipole: 2.6354 -1.1016 -1.2711
dipole: 3.1265
quadrupole: -111.8538 -105.7845 -112.7573
quadrupole: -0.8926 3.5974 1.0512
quadrupole: -1.7219 4.3474 -2.6254 -0.8926 3.5974 1.0512
hfenergy: -1127.1172772 hartree
pointgroup: C01 [X(C14H20N2O1S1)]
dipole: 1.0982072 0.303329 0.4636131 debye
polarizability: 208.8498042|-7.8902034|216.0749147|-3.4842067|1.116016|133.8215999 unknown
InChI: InChI=1S/C14H20N2OS/c1-15(2)9-10-16(17)13-7-5-11-18-14-8-4-3-6-12(13)14/h3-4,6-8,17H,5,9-11H2,1-2H3
charge 0 multiplicity 1
38 atoms
S  -3.310478 1.165019 -0.675325
O  1.141115 -0.288316 -2.053933
N  1.001182 0.973929 -1.293678
N  3.122028 -0.570797 0.436265
C  -0.088874 0.986224 -0.355607
C  2.343883 1.462519 -0.902875
C  2.937068 0.895754 0.408839
C  -0.866787 -0.266824 -0.115723
C  -1.53404 2.272007 1.288336
C  -0.406821 2.159407 0.284007
C  -2.295576 -0.278565 -0.132441
C  -2.912102 2.502737 0.632729
C  -0.17825 -1.476984 0.184735
C  -3.000055 -1.477348 0.144711
C  3.487964 -1.041908 1.788828
C  4.042377 -1.076765 -0.602879
C  -0.886648 -2.664219 0.455965
C  -2.30201 -2.669688 0.431748
H  3.003664 1.269511 -1.764659
H  2.281738 2.561393 -0.789475
H  3.904064 1.441026 0.588962
H  2.256575 1.163201 1.24016
H  -1.595433 1.357024 1.908051
H  -1.341829 3.11602 1.980451
H  0.151954 3.07258 0.043751
H  -3.718813 2.498056 1.386756
H  -2.938724 3.449224 0.065256
H  0.919634 -1.454106 0.197386
H  -4.094552 -1.461383 0.133317
H  2.717084 -0.725059 2.514283
H  4.476543 -0.652854 2.142668
H  3.534671 -2.14562 1.798441
H  3.627502 -0.871309 -1.602673
H  4.137284 -2.172394 -0.501149
H  5.068053 -0.632267 -0.533901
H  -0.337364 -3.584452 0.684994
H  -2.858855 -3.589825 0.642316
H  0.57063 -0.128148 -2.852938
