program: Gaussian 09
title: 000216008
version: EM64L-G09RevD.01
frameworkgroup: C1[X(C4H4N6S4)]
method: RPBEPBE
basis: SDD
operation: Freq
keyword: #pfreq=noraman
keyword: PBEPBE/SDD
title: #p freq=noraman PBEPBE/SDD
converged: YES YES NO NO
title: Mulliken charges:
elementType: S S S S N N N N N N C C C C H H H H
charge: 0.269077 0.269085 0.171792 0.171804 0.068341 0.068327 -0.074623 -0.074620 -0.559304 -0.559305 -0.456249 -0.456247 -0.110795 -0.110796 0.350017 0.341739 0.341739 0.350017
chargesum: 0.00000
title: Mulliken charges with hydrogens summed into heavy atoms:
elementType: S S S S N N N N N N C C C C
charge: 0.269077 0.269085 0.171792 0.171804 0.068341 0.068327 -0.074623 -0.074620 0.132452 0.132451 -0.456249 -0.456247 -0.110795 -0.110796
polarizability: 3.34190119e+02 2.52508803e-03 1.80397045e+02 -1.73940922e+01 3.30039326e-03 9.17908809e+01
1716.lowfreq: 0.0025 0.0025 0.0030 4.0770 6.0664 6.9098 19.0098 31.3871 37.9394
frequency: 18.9034 31.2739 37.9256 61.0439 69.6867 126.2593 155.8072 223.2605 224.7184 269.4935 324.5865 349.1930 356.6829 359.9364 382.4493 390.3775 401.8011 416.9769 477.8187 481.2446 501.8607 502.1182 555.9405 557.1913 588.8545 589.8759 604.3337 605.2228 709.6471 713.7188 881.3120 882.7616 959.6147 959.9066 1121.4058 1127.8683 1245.5083 1255.6362 1295.1494 1295.4427 1484.1315 1492.9401 1614.5173 1616.8678 3540.7551 3541.9688 3698.1117 3698.3045
redmass: 9.4758 11.8850 14.3431 9.3726 11.3530 8.1463 9.3408 9.5345 9.8974 14.4213 4.7240 2.8855 4.6942 3.1319 1.4433 2.2250 5.4301 5.8602 10.6583 10.9257 1.4380 1.4461 5.6081 5.4445 8.2920 8.4802 6.3785 6.4811 9.0176 9.3775 9.5508 9.2333 2.8429 2.7794 8.4807 7.4248 2.7103 2.7874 11.1311 12.6535 4.5379 4.1594 1.2709 1.3041 1.0459 1.0463 1.1038 1.1038
irintensity: 0.0040 0.1288 2.6542 8.2208 0.0640 2.3215 13.3029 4.1896 8.7632 2.2798 5.7091 0.0000 23.4086 0.2761 60.4446 7.2510 73.2390 11.2372 2.0769 31.7993 416.5355 14.1188 1.1975 48.7904 3.0530 0.0040 67.1241 1.8381 10.2664 1.6696 23.7630 38.1527 4.8711 10.3259 341.1257 19.0364 72.2445 39.5677 266.5056 65.9758 561.4236 294.5008 324.0283 358.2623 342.7823 144.2065 29.6348 84.7337
temp: 298.150 k
press: 1.00000 atm
elementType: 16 16 16 16 7 7 7 7 7 7 6 6 6 6 1 1 1 1
symmnumber: 1
zpe: 256003.3 jmol-1
zpe.correction: 0.097506 hartree
zpe.thermalcorrener: 0.112584 hartree
zpe.thermalcorrenthalpy: 0.113528 hartree
zpe.thermalcorrgfe: 0.052156 hartree
zpe.sumelectzpe: -2074.481928 hartree
zpe.sumelectthermal: -2074.466850 hartree
zpe.sumelectthermalent: -2074.465906 hartree
zpe.sumelectthermalfe: -2074.527278 hartree
dipole: 0.0010 10.6130 0.0009
dipole: 10.6130
quadrupole: -94.9835 -94.6069 -113.0716
quadrupole: -0.0007 1.5259 -0.0001
quadrupole: 5.9038 6.2804 -12.1842 -0.0007 1.5259 -0.0001
hfenergy: -2074.5794341 hartree
pointgroup: C01 [X(C4H4N6S4)]
dipole: 0.0045471 -4.1754529 0.0083316 debye
dipolederiv: -0.3635614 0.0946973 -0.2105392 -0.0287718 -0.5104297 -0.1643629 -0.2134269 -0.0598564 -0.0043451 -0.3634979 -0.0951996 -0.2104179 0.0282331 -0.5096777 0.1659081 -0.2136482 0.0614306 -0.0051322 0.3945014 -0.3086587 -0.1205775 -0.3975994 0.0418399 -0.0643051 0.2630501 0.0761622 0.0377576 0.3930133 0.3088622 -0.1220789 0.3994717 0.0432923 0.0640229 0.2611986 -0.0756763 0.0378964 0.9538766 -0.3861789 -0.0833876 -0.6108122 -0.2351419 -0.165033 0.4705695 -0.2120535 -0.1548497 0.9519377 0.3883409 -0.0854265 0.6152339 -0.2315106 0.1650329 0.4674668 0.2131614 -0.1563958 -0.5590278 -0.1547124 -0.0965569 1.7321369 -0.8218601 -0.0191189 0.05224 -0.1726292 -0.2362928 -0.5556419 0.1550009 -0.097183 -1.731417 -0.8242996 0.0214779 0.0587542 0.1749773 -0.2370197 -0.9791787 0.5908193 0.1141453 1.3038141 -1.1290283 0.1139621 0.0407562 0.1932178 -0.575516 -0.9750787 -0.5900653 0.1167378 -1.303393 -1.1341846 -0.1112711 0.0465086 -0.1906849 -0.5744011 -0.5350899 0.1940808 0.2282458 -0.2097132 0.7410974 0.245675 -0.4266811 0.4141738 -0.0505158 -0.5353278 -0.1959069 0.2295733 0.205262 0.7383693 -0.2483911 -0.4263707 -0.4180723 -0.0478613 0.5503188 -0.3034099 0.3228185 -1.7210596 1.413757 0.0383911 -0.0594268 0.0522605 0.2718817 0.5459583 0.3028166 0.3216361 1.7190052 1.4175809 -0.0424447 -0.0661586 -0.0569011 0.2721409 0.3880435 -0.0607717 -0.0636142 -0.0235258 0.1858443 -0.0355521 -0.0096219 -0.056845 0.3619193 0.1506332 -0.000209 -0.0897321 -0.138445 0.31378 -0.023516 -0.1174128 -0.0099562 0.3496068 0.1502716 -0.0004716 -0.0897244 0.1376435 0.3141836 0.0234342 -0.1179357 0.0098147 0.3495401 0.3878497 0.0609659 -0.0639185 0.0239366 0.1863878 0.0360909 -0.0098613 0.0574766 0.3615869 unknown
polarizability: 335.3757429|0.1603426|180.3968342|3.7034112|-0.1800926|90.6054677 unknown
InChI: InChI=1S/2C2H2N3S2/c2*3-1-4-5-2(6)7-1/h2*3H2
charge 0 multiplicity 1
18 atoms
S  1.928813 -1.017715 -0.821239
S  -1.925333 -1.018157 0.824529
S  0.71622 1.937885 -0.981519
S  -0.71891 1.940603 0.972511
N  3.162049 1.201101 0.087032
N  -3.163544 1.194389 -0.092227
N  4.048841 0.174075 0.331008
N  -4.048251 0.164521 -0.33178
N  4.317968 -2.174459 0.095136
N  -4.312226 -2.18365 -0.08661
C  2.013058 0.847787 -0.500467
C  -2.013577 0.845836 0.496218
C  3.577048 -1.039012 -0.068463
C  -3.573717 -1.045967 0.072293
H  5.239375 -2.079636 0.521595
H  3.987162 -3.089476 -0.195942
H  -3.979312 -3.096814 0.207875
H  -5.233967 -2.092511 -0.513149
