program: Gaussian 09
title: 000216012
version: EM64L-G09RevD.01
frameworkgroup: C1[X(C9H17N5O2)]
method: RPBEPBE
basis: SDD
operation: Freq
keyword: #p
keyword: freq=noraman
keyword: PBEPBE/SDD
title: #p freq=noraman PBEPBE/SDD
converged: YES YES NO NO
title: Mulliken charges:
elementType: O O N N N N N C C C C C C C C C H H H H H H H H H H H H H H H H H
charge: -0.466072 -0.455915 -0.124320 -0.286860 -0.091834 -0.355301 -0.566041 -0.464779 0.015156 -0.432160 0.298380 -0.701517 -0.292092 -0.264867 -0.310010 0.164122 0.246817 0.243058 0.167732 0.212842 0.258588 0.208262 0.196975 0.239500 0.216983 0.190167 0.234891 0.394038 0.243310 0.351750 0.328772 0.299221 0.301202
chargesum: 0.00000
title: Mulliken charges with hydrogens summed into heavy atoms:
elementType: O O N N N N N C C C C C C C C C
charge: -0.072033 -0.104166 -0.124320 -0.286860 -0.091834 -0.026529 0.034382 0.025096 0.182888 0.039270 0.298380 -0.054866 0.113145 -0.029976 -0.066700 0.164122
polarizability: 2.23406586e+02 2.87183343e+00 1.44029772e+02 -1.70365347e+00 9.48424911e+00 9.28075650e+01
1716.lowfreq: -5.5216 -0.0005 0.0002 0.0005 5.4440 11.3869 34.3715 45.6293 53.1059
frequency: 34.3133 45.4633 53.0880 76.3865 82.5159 94.1648 101.3025 123.2967 188.0385 214.2002 222.2396 233.1169 249.9757 266.6752 299.1934 307.6650 320.0206 360.6959 386.8798 402.8151 412.6376 435.5457 463.5855 497.8807 529.8197 576.1748 581.6733 620.3213 650.5012 706.7923 735.9717 811.3860 817.9430 823.4825 838.8643 847.5923 883.3038 914.9759 940.3579 943.5299 967.5676 979.3270 1031.8012 1060.4568 1094.5913 1105.2379 1107.4781 1125.5221 1162.6261 1192.4477 1203.6287 1215.1737 1220.5687 1226.3237 1244.1747 1284.2378 1290.6554 1305.2654 1320.4074 1331.3819 1351.7687 1362.7577 1376.7745 1380.5922 1395.2672 1425.8255 1450.2660 1455.3618 1467.8128 1470.2699 1477.9307 1493.1085 1512.3282 1542.4377 1608.5405 1657.0299 2891.6517 2937.0301 2953.9223 2979.5376 2992.4351 3001.3201 3006.7674 3058.0270 3074.5287 3087.6457 3096.3938 3146.9703 3171.3525 3455.4807 3536.9889 3581.3184 3590.9408
redmass: 4.8612 3.6714 4.5843 4.2161 4.4733 3.7386 4.3023 4.6499 3.5459 1.3894 2.4442 1.3190 2.2210 2.6782 1.4065 1.6482 2.3522 3.1372 3.1252 5.9244 3.8595 3.0846 2.2896 2.1835 3.0936 3.6088 4.3195 1.0821 7.9016 4.4852 5.5159 1.6316 2.4708 5.6307 1.4979 1.9586 1.9327 2.0913 1.7607 1.4080 3.4582 3.1975 2.8284 2.0304 2.5964 2.2308 2.0971 2.0662 1.6378 3.0586 1.4424 1.2065 2.3946 1.4611 1.9167 1.3100 1.4761 1.5940 1.2948 1.7569 1.2662 1.3571 2.0159 1.5892 1.3939 2.3405 1.1196 1.0672 1.3729 1.0899 1.0535 1.5862 1.2321 4.3008 6.1298 1.0930 1.0829 1.0570 1.0713 1.0368 1.0796 1.0657 1.0836 1.1022 1.0996 1.0995 1.0988 1.0878 1.0972 1.0399 1.0771 1.0667 1.1070
irintensity: 0.1829 7.7546 2.0504 0.1727 0.8276 9.1395 1.6863 2.8403 15.5734 11.3913 2.4255 113.8300 30.3903 5.4380 306.5275 4.1559 87.0367 21.3683 2.6565 1.2750 4.6215 5.4248 4.7539 16.1324 3.2559 6.7325 12.7583 175.6709 0.4103 3.8409 2.0843 33.3048 9.1027 3.8406 81.2427 12.6598 14.8630 11.0939 25.5089 10.1833 75.2097 3.7670 46.4709 8.0149 28.4317 1.5459 23.9491 12.8606 38.6045 36.4642 22.8319 28.4957 43.4264 20.4043 21.4564 5.9755 1.6037 32.3237 5.0911 2.4461 4.4952 60.0771 136.5538 11.4862 2.8461 19.8967 12.7429 35.7712 143.9797 4.6016 10.1095 153.3920 108.9607 332.0270 2.6899 18.6147 133.4305 50.0517 850.2571 7.3412 11.9065 28.8124 101.9025 18.9949 36.8346 19.5871 26.8691 11.7700 12.8132 6.9591 60.9307 5.0583 1.7557
temp: 298.150 k
press: 1.00000 atm
elementType: 8 8 7 7 7 7 7 6 6 6 6 6 6 6 6 6 1 1 1 1 1 1 1 1 1 1 1 1 1 1 1 1 1
symmnumber: 1
zpe: 709108.2 jmol-1
zpe.correction: 0.270085 hartree
zpe.thermalcorrener: 0.287639 hartree
zpe.thermalcorrenthalpy: 0.288583 hartree
zpe.thermalcorrgfe: 0.224043 hartree
zpe.sumelectzpe: -776.020743 hartree
zpe.sumelectthermal: -776.003189 hartree
zpe.sumelectthermalent: -776.002245 hartree
zpe.sumelectthermalfe: -776.066785 hartree
dipole: 2.0563 9.0573 0.6973
dipole: 9.3139
quadrupole: -83.3320 -97.0743 -93.1885
quadrupole: -0.5232 3.8723 -0.5830
quadrupole: 7.8663 -5.8760 -1.9903 -0.5232 3.8723 -0.5830
hfenergy: -776.2908281 hartree
pointgroup: C01 [X(C9H17N5O2)]
dipole: -1.3253432 -3.4158652 -0.0548877 debye
polarizability: 222.1357947|-8.5068951|146.0618856|7.0410256|-6.1538849|92.0462428 unknown
InChI: InChI=1S/C9H17N5O2/c1-7(16)6-14(4-5-15)9-3-2-8(11-10)12-13-9/h2-3,7,11,15-16H,4-6,10H2,1H3
charge 0 multiplicity 1
33 atoms
O  1.676051 2.544197 0.6127
O  2.8230 -2.869719 -0.804391
N  1.114629 -0.65051 0.364876
N  -0.45367 1.057702 -0.072716
N  -1.718498 1.533454 -0.262936
N  -4.036077 1.279186 -0.316971
N  -5.257387 0.64016 -0.11854
C  2.214909 0.225779 -0.12547
C  2.584528 1.418573 0.802849
C  1.473651 -1.942121 0.967536
C  -0.215009 -0.268923 0.238971
C  4.007608 1.92277 0.510037
C  1.597385 -3.110371 -0.027857
C  -1.32097 -1.167311 0.421544
C  -2.618994 -0.683177 0.260807
C  -2.787631 0.688939 -0.101292
H  3.087787 -0.431488 -0.272469
H  1.929978 0.639455 -1.112691
H  2.534988 1.057493 1.858076
H  0.740082 -2.211911 1.750872
H  2.45009 -1.832848 1.474006
H  0.704909 -3.151927 -0.686573
H  1.674103 -4.06456 0.538539
H  4.193338 2.838157 1.097039
H  4.114057 2.18155 -0.559521
H  4.770186 1.16624 0.775795
H  -1.160825 -2.219789 0.668542
H  0.785701 2.157332 0.288785
H  -3.487399 -1.334877 0.392887
H  2.873165 -3.496175 -1.568084
H  -4.043275 2.275248 -0.544982
H  -5.516251 0.426302 0.847548
H  -5.545161 -0.02803 -0.835915
