program: Gaussian 09
title: 000210619
version: EM64L-G09RevD.01
frameworkgroup: C1[X(C14H18BrNO2)]
method: RPBEPBE
basis: SDD
operation: Freq
keyword: #p
keyword: freq=noraman
keyword: PBEPBE/SDD
title: #p freq=noraman PBEPBE/SDD
converged: YES YES NO NO
title: Mulliken charges:
elementType: Br O O N C C C C C C C C C C C C C C H H H H H H H H H H H H H H H H H H
charge: 0.005893 -0.240672 -0.248473 -0.269226 0.142913 0.321220 0.325720 -0.441898 -0.011451 -0.693404 -0.723684 0.206305 -0.300246 -0.339030 -0.689716 -0.696068 -0.272914 -0.211586 0.269727 0.211750 0.200564 0.243978 0.227072 0.230229 0.245019 0.202665 0.250043 0.255428 0.241924 0.222880 0.202761 0.219429 0.211770 0.242505 0.206676 0.251896
chargesum: 0.00000
title: Mulliken charges with hydrogens summed into heavy atoms:
elementType: Br O O N C C C C C C C C C C C C C C
charge: 0.005893 -0.240672 -0.248473 -0.269226 0.142913 0.321220 0.325720 0.039579 0.189113 0.007875 -0.025956 0.206305 -0.044818 -0.097106 -0.044646 -0.035117 -0.272914 0.040310
polarizability: 2.56180562e+02 5.00133308e+00 1.74652969e+02 -1.14667419e+01 1.11933161e+01 1.16395528e+02
1716.lowfreq: -11.8901 -0.0005 0.0000 0.0004 1.6465 5.7170 26.1616 46.1746 63.8331
frequency: 25.2847 46.0538 63.8169 82.6391 115.7622 122.0921 133.5999 135.5442 201.7222 207.1550 231.2845 238.1519 257.0854 264.5479 273.8029 287.5843 300.6136 328.7753 331.7771 364.6130 379.1814 412.9071 435.9545 448.7521 485.3308 497.9118 516.2916 572.7521 583.4887 594.5804 659.9395 691.0765 700.3394 740.5702 774.7153 791.9010 809.0165 815.5228 882.7505 886.3470 916.1467 921.7018 937.0604 943.0267 957.7902 962.7014 978.7031 1001.9313 1038.7303 1070.0454 1084.3400 1102.8315 1125.7669 1151.2332 1155.7679 1189.8417 1202.1004 1206.8411 1257.7641 1279.2271 1282.3759 1303.8263 1316.5545 1342.2571 1369.7749 1379.0048 1380.8860 1383.4747 1398.5566 1401.7391 1410.0711 1454.6417 1461.2482 1463.8892 1472.7525 1474.1045 1477.3423 1480.0194 1484.0996 1487.1865 1494.3460 1578.4236 1600.7554 1643.3199 2957.6653 2974.3907 2981.4734 2990.3662 3003.7304 3029.6031 3067.1470 3070.1352 3074.3020 3086.2587 3090.3704 3091.7985 3097.6709 3103.0963 3113.6455 3163.6131 3168.9070 3187.2465
redmass: 3.1693 4.7094 3.9640 4.0321 4.0592 4.5538 5.0860 5.4421 1.2448 3.1892 2.3331 1.1775 1.2370 1.4501 1.7510 3.6868 3.1348 5.2118 3.3487 2.7867 2.8049 3.9823 3.3327 2.3185 3.5309 5.4972 4.1280 4.0937 3.8493 4.1924 5.9125 5.0175 8.1899 3.5552 4.4209 3.5856 1.6122 2.9159 1.5930 1.7674 1.5357 1.7459 1.6100 1.3655 1.8016 2.0044 2.9441 1.3106 3.4691 2.7953 2.0300 1.9107 2.2550 2.0335 1.5583 2.0385 3.4652 1.9795 1.7844 1.7300 2.5756 1.8272 1.6115 1.6164 2.0408 1.4063 1.3694 1.6356 1.3527 1.2624 2.5703 1.0862 1.0536 1.0535 1.1922 1.2411 1.0848 1.2799 1.0730 1.2070 1.0856 8.4612 7.0191 9.9039 1.0827 1.0358 1.0363 1.0348 1.0360 1.0607 1.0993 1.0993 1.0986 1.1023 1.0996 1.0999 1.1009 1.0994 1.1008 1.0892 1.0917 1.0950
irintensity: 0.3467 0.4537 2.8141 0.4818 0.9558 0.2106 0.7053 1.0159 0.2633 0.3718 0.8172 0.1945 0.3786 0.2681 0.9803 0.8431 1.9293 5.6222 1.2271 0.6200 1.9405 1.7223 4.1923 5.6733 10.1508 26.6308 2.9939 6.9249 1.2857 4.5519 4.5959 11.9523 13.7341 1.8959 12.6446 36.5439 48.3291 3.8135 3.9319 24.7852 3.9849 12.9437 4.5649 0.8683 13.0544 3.6442 10.6456 0.7115 36.2187 58.9919 3.0161 56.5245 31.1672 37.7693 23.7128 32.4014 27.5781 82.7913 58.2450 92.0766 5.6258 10.5870 15.0246 13.1016 4.7781 11.2782 8.7854 19.8651 31.1809 21.2491 78.4062 17.2180 8.2427 12.7075 44.8226 79.8609 14.6122 57.8900 67.0149 26.7326 28.1725 4.1869 39.3412 469.4361 29.8864 23.3916 20.1723 13.0053 12.2219 36.5437 9.7095 30.2887 122.8808 9.0026 13.3957 18.1950 8.2881 25.3348 20.0179 3.1006 2.6808 8.6338
temp: 298.150 k
press: 1.00000 atm
elementType: 35 8 8 7 6 6 6 6 6 6 6 6 6 6 6 6 6 6 1 1 1 1 1 1 1 1 1 1 1 1 1 1 1 1 1 1
symmnumber: 1
zpe: 765411.8 jmol-1
zpe.correction: 0.291530 hartree
zpe.thermalcorrener: 0.309900 hartree
zpe.thermalcorrenthalpy: 0.310844 hartree
zpe.thermalcorrgfe: 0.244647 hartree
zpe.sumelectzpe: -761.617139 hartree
zpe.sumelectthermal: -761.598769 hartree
zpe.sumelectthermalent: -761.597825 hartree
zpe.sumelectthermalfe: -761.664021 hartree
dipole: -0.9951 -2.2780 2.1458
dipole: 3.2839
quadrupole: -134.4103 -109.3602 -119.3622
quadrupole: -14.0400 6.7308 9.5434
quadrupole: -13.3661 11.6840 1.6821 -14.0400 6.7308 9.5434
hfenergy: -761.9086687 hartree
pointgroup: C01 [X(C14H18Br1N1O2)]
dipole: 0.3337813 -0.91225 -0.8518502 debye
polarizability: 255.109786|-12.7351626|177.0431688|-6.5924941|-9.0705955|115.0761038 unknown
InChI: InChI=1S/C14H18BrNO2/c1-9(2)8-16-12-6-5-10(15)7-11(12)14(3,4)18-13(16)17/h5-7,9H,8H2,1-4H3
charge 0 multiplicity 1
36 atoms
Br 5.049096 -1.066789 0.133755
O  -0.687409 2.163076 0.628307
O  -2.746962 1.359896 1.232166
N  -1.088859 -0.195344 0.626897
C  0.496374 1.957602 -0.298357
C  1.158638 0.640912 0.086727
C  0.313324 -0.437315 0.48425
C  -2.070624 -1.298434 0.837635
C  -2.709722 -1.870688 -0.459021
C  -0.039226 1.910733 -1.74882
C  1.351201 3.205811 -0.049137
C  -1.585788 1.114118 0.835935
C  2.552503 0.449703 -0.001832
C  0.895583 -1.703657 0.748715
C  -1.700569 -2.596204 -1.379821
C  -3.499064 -0.793638 -1.239012
C  3.108072 -0.81378 0.276174
C  2.288464 -1.897099 0.642537
H  -2.870565 -0.876518 1.468717
H  -1.587001 -2.106217 1.41345
H  -3.439184 -2.626587 -0.094523
H  -0.614676 2.827555 -1.964011
H  0.80404 1.84255 -2.458626
H  -0.692935 1.035643 -1.909342
H  1.745121 3.213964 0.980527
H  2.194403 3.260217 -0.759503
H  0.725451 4.102639 -0.189775
H  3.200669 1.279355 -0.29586
H  0.279889 -2.556083 1.040689
H  -0.936054 -1.898298 -1.76863
H  -1.17543 -3.415366 -0.853894
H  -2.223835 -3.035224 -2.24919
H  -4.052384 -1.253701 -2.07823
H  -4.218846 -0.266691 -0.588833
H  -2.818679 -0.03302 -1.666315
H  2.720186 -2.880019 0.850351
