program: Gaussian 09
title: 000210618
version: EM64L-G09RevD.01
frameworkgroup: C1[X(C10H9Br2NO2)]
method: RPBEPBE
basis: SDD
operation: Freq
keyword: #p
keyword: freq=noraman
keyword: PBEPBE/SDD
title: #p freq=noraman PBEPBE/SDD
converged: YES YES NO NO
title: Mulliken charges:
elementType: Br Br O O N C C C C C C C C C C H H H H H H H H H
charge: 0.042445 0.029266 -0.236745 -0.217989 -0.478038 0.146808 0.345547 0.494840 -0.714477 -0.684046 -0.302891 -0.441404 0.178962 -0.273470 -0.176637 0.203826 0.245795 0.252465 0.226607 0.246375 0.238440 0.257777 0.341421 0.275122
chargesum: 0.00000
title: Mulliken charges with hydrogens summed into heavy atoms:
elementType: Br Br O O N C C C C C C C C C C
charge: 0.042445 0.029266 -0.236745 -0.217989 -0.136617 0.146808 0.345547 0.494840 -0.012390 0.027375 -0.045114 -0.441404 0.178962 -0.273470 0.098485
polarizability: 2.19327245e+02 8.36966905e+00 1.77273034e+02 -1.68920956e+00 8.91332575e-02 7.39314863e+01
1716.lowfreq: -5.5613 -1.8969 -0.0004 -0.0003 0.0005 4.0721 41.3743 84.0870 109.2149
frequency: 41.3511 84.0851 109.2140 115.7072 123.0548 152.0689 166.2445 201.8006 225.7240 248.3237 258.6756 263.3907 311.9892 329.5328 353.4351 383.8582 435.2225 475.7298 493.2400 537.6916 550.0376 571.6121 593.7966 651.2323 708.2745 727.1494 751.7650 762.4403 811.5788 849.5686 869.7863 887.5200 919.0207 937.8203 941.6153 1002.5399 1087.6791 1092.0411 1127.5539 1177.0509 1198.4543 1244.2732 1272.3414 1280.6606 1343.8156 1381.8465 1392.8043 1402.4060 1416.5275 1453.6239 1460.5218 1470.9582 1477.0287 1482.8792 1564.6772 1601.0368 1683.3692 2991.8260 3005.3851 3091.9865 3099.9267 3105.0306 3115.9229 3176.0926 3185.3128 3522.7276
redmass: 6.1675 6.0535 5.2507 17.2751 9.0064 7.6084 4.1686 1.0989 11.4797 1.4533 2.5329 2.7208 4.5922 3.1408 5.3411 6.1898 4.6824 4.9491 7.8869 4.7331 3.9627 4.2702 4.3749 1.8187 3.2301 5.8354 5.9424 7.5440 3.8420 5.1411 1.4184 1.4360 2.6489 2.3902 2.5026 1.3071 1.9301 3.1250 2.3402 2.2818 3.8468 2.9586 2.4095 2.3306 3.4467 1.2123 3.4349 1.2926 2.4052 1.1431 1.0704 2.2488 1.1683 1.0709 8.2623 7.5587 8.0603 1.0349 1.0361 1.0999 1.1010 1.0995 1.1009 1.0920 1.0934 1.0770
irintensity: 2.2662 0.6234 0.4814 0.0900 0.7632 1.9154 0.0829 0.1229 1.6927 1.2484 1.7682 0.4737 3.2471 1.7582 0.4280 3.7935 9.1936 0.2798 21.2673 4.3551 10.3760 6.8556 11.2619 30.5793 60.7218 53.7062 35.5316 10.0468 7.4877 19.3444 23.0043 5.3962 26.2587 46.3878 26.3692 0.5949 1.6742 43.9803 36.7366 101.5199 34.8699 46.3306 163.8342 50.3807 5.6700 24.9788 37.7458 31.3889 9.4204 36.2973 11.9798 173.6125 26.8927 23.7171 20.5475 2.6345 741.3574 10.0258 10.5701 11.7098 8.9317 24.0571 19.2944 0.7156 0.3117 59.7750
temp: 298.150 k
press: 1.00000 atm
elementType: 35 35 8 8 7 6 6 6 6 6 6 6 6 6 6 1 1 1 1 1 1 1 1 1
symmnumber: 1
zpe: 447115.4 jmol-1
zpe.correction: 0.170297 hartree
zpe.thermalcorrener: 0.184767 hartree
zpe.thermalcorrenthalpy: 0.185711 hartree
zpe.thermalcorrgfe: 0.127454 hartree
zpe.sumelectzpe: -617.518842 hartree
zpe.sumelectthermal: -617.504373 hartree
zpe.sumelectthermalent: -617.503428 hartree
zpe.sumelectthermalfe: -617.561686 hartree
dipole: -3.1013 -0.9423 1.8859
dipole: 3.7500
quadrupole: -132.0413 -94.5240 -107.8200
quadrupole: 3.6885 6.9221 -2.7604
quadrupole: -20.5796 16.9378 3.6418 3.6885 6.9221 -2.7604
hfenergy: -617.6891396 hartree
pointgroup: C01 [X(C10H9Br2N1O2)]
dipole: 1.0729039 0.8355185 0.5722678 debye
dipolederiv: -0.0793262 -0.0164324 0.0110469 0.0056743 -0.6357053 0.1131951 -0.0005945 0.1180843 -0.0212801 -0.6202451 -0.2563356 0.0833408 -0.2810127 -0.1877127 0.0489512 0.0858127 0.0496464 -0.030091 -0.569795 -0.1970163 0.0025162 -0.1467404 -1.1894965 -0.0379722 0.0198722 0.1604756 -0.3590845 -1.3901489 -0.3218522 -0.0848697 -0.4411758 -0.7122618 -0.0315913 -0.073166 0.0243151 -0.3555568 -1.7624531 -0.1108645 -0.0747312 0.1131408 -0.3937245 0.0186322 -0.203718 0.0518133 -0.369465 0.5056376 0.0635123 0.0166458 -0.0312726 0.6161477 0.1052714 0.0630228 0.1005286 0.4506629 -0.1019033 0.0724284 -0.0723415 -0.2591096 -0.0038395 -0.0032872 0.0160757 -0.0104524 -0.1150896 0.9864989 0.2434143 -0.065992 0.6642184 -0.2692156 0.0932842 -0.0991104 0.088047 0.1047851 -0.0269578 0.0575357 -0.0126312 0.0179244 -0.0902423 0.053131 0.0200912 0.0496668 -0.0323736 -0.091552 0.0457059 0.0737899 0.0407414 -0.063221 -0.0133199 -0.0238674 -0.0316824 -0.1548086 -0.2520599 -0.147674 0.0407041 -0.0854644 -0.0527485 -0.003019 0.0340316 -0.000843 -0.0673762 -0.1514955 -0.0722008 -0.0134075 0.0072353 1.1514427 -0.2442487 -0.0237064 -0.2621126 -0.1038587 2.3851722 0.2392197 0.2385129 0.0313741 1.488049 -0.0963141 0.3444599 -0.3156515 0.3850589 0.996407 0.4651106 -0.1561271 0.5570365 0.2104253 -0.1105885 -0.1740865 -0.092548 -0.1194779 -0.2593255 -0.0822751 0.0469545 -0.194957 -0.3204031 0.0715515 0.0408817 0.0670592 -0.0335984 0.0106964 -0.1383023 -0.048132 -0.0894107 -0.002747 -0.0302049 -0.0636854 -0.0441223 0.0479651 0.0926603 0.0002141 0.0672653 0.0063134 0.0774762 -0.0529592 0.05751 -0.0336613 -0.0876551 -0.0766873 0.1115438 -0.004146 0.0645878 0.059519 0.0099119 0.0216691 0.0089031 0.1017082 0.0032515 -0.1140099 -0.0520363 -0.0874548 0.0160877 -0.0575461 -0.0323219 -0.0385238 0.0707218 -0.0780357 0.1164868 0.0261944 0.0989502 0.0513281 -0.0196145 0.0202618 -0.0232962 0.0730974 0.1001669 0.0026851 0.0037891 -0.0203593 -0.0398743 0.1198674 -0.0248571 0.0808572 0.0136739 0.1342595 0.0008299 0.0039412 -0.0115922 -0.026777 0.0296756 0.0025511 0.0204242 0.1336066 0.2051669 -0.0090642 -0.0258504 -0.0119634 0.2346036 0.0240371 -0.007127 0.0185933 0.3116633 0.0400682 0.0473405 -0.0044361 0.0533165 0.0828899 0.013157 0.0000006 0.0144793 0.1567724 unknown
polarizability: 210.3048885|18.301585|183.0964149|-6.6321147|-18.4721653|77.130462 unknown
InChI: InChI=1S/C10H9Br2NO2/c1-10(2)6-3-5(11)4-7(12)8(6)13-9(14)15-10/h3-4,13H,1-2H3
charge 0 multiplicity 1
24 atoms
Br 1.183348 -3.427037 0.569543
Br 4.32105 1.337424 -0.507803
O  -2.285963 0.571439 -0.607083
O  -3.475425 -1.375803 -0.232776
N  -1.200045 -1.334836 0.274602
C  -1.156209 1.442346 -0.073214
C  0.151015 0.648967 -0.128905
C  0.070603 -0.74953 0.123952
C  -1.193791 2.663713 -0.998966
C  -1.507572 1.810066 1.387206
C  1.406072 1.256451 -0.327393
C  1.269311 -1.50121 0.207918
C  -2.397354 -0.752667 -0.174129
C  2.579958 0.480331 -0.243332
C  2.530876 -0.900808 0.033784
H  -0.505511 3.450651 -0.644944
H  -0.924767 2.385532 -2.031188
H  -2.215087 3.078474 -1.003982
H  -0.752526 2.505678 1.794164
H  -2.496961 2.297568 1.41929
H  -1.533603 0.915967 2.034431
H  1.472878 2.327544 -0.532803
H  -1.263295 -2.321712 0.5389
H  3.443596 -1.496748 0.102426
