program: Gaussian 09
title: 000215998
version: EM64L-G09RevD.01
frameworkgroup: C1[X(C14H15N3O)]
method: RPBEPBE
basis: SDD
operation: Freq
keyword: #p
keyword: freq=noraman
keyword: PBEPBE/SDD
title: #p freq=noraman PBEPBE/SDD
converged: YES YES NO NO
title: Mulliken charges:
elementType: O N N N C C C C C C C C C C C C C C H H H H H H H H H H H H H H H
charge: -0.278137 -0.487656 -0.055430 -0.686754 0.340820 -0.035535 0.255041 -0.260838 0.138098 0.135266 -0.300660 -0.814871 -0.334266 -0.325503 0.505471 -0.417542 -0.435097 -0.787013 0.334806 0.315817 0.233076 0.221329 0.224370 0.275989 0.271684 0.201390 0.222565 0.220584 0.248997 0.225618 0.225234 0.310786 0.312359
chargesum: 0.00000
title: Mulliken charges with hydrogens summed into heavy atoms:
elementType: O N N N C C C C C C C C C C C C C C
charge: -0.278137 -0.152850 -0.055430 -0.063609 0.340820 -0.035535 0.255041 0.054979 0.138098 0.135266 -0.067584 -0.093183 -0.062582 -0.124113 0.505471 -0.194978 -0.214513 -0.087163
polarizability: 3.41706203e+02 -1.33313907e+01 1.76148890e+02 -3.93564401e+00 -4.09376193e+00 8.22437394e+01
1716.lowfreq: -25.7186 -8.9520 -2.9185 -0.0006 -0.0004 0.0006 2.5511 24.2427 32.0240
frequency: -25.6453 24.1690 32.0137 57.6308 79.7670 100.5378 141.4383 178.0124 186.1979 215.3979 220.8410 280.0716 289.6716 306.9634 360.7968 371.9738 401.2490 406.9155 408.7957 428.8009 459.2283 460.2684 505.3386 534.8528 555.5414 573.1884 616.4267 623.5980 636.1421 684.0620 699.3113 755.0353 759.3408 781.3652 810.4153 820.9461 842.9682 858.2662 866.9022 922.8427 935.7052 954.3228 984.1463 996.6329 997.1883 1018.9441 1020.4968 1038.3147 1049.2956 1069.1841 1121.6159 1135.4549 1187.7512 1193.5754 1254.0874 1257.4840 1298.0208 1311.9977 1327.7878 1336.9411 1367.0446 1383.4153 1385.5536 1391.5821 1417.9338 1445.7291 1461.7798 1469.7949 1474.5582 1480.8708 1498.1363 1520.4120 1559.9284 1575.8736 1590.0925 1602.8105 1632.4858 1646.5907 2955.7630 2979.5727 3027.1402 3056.0910 3104.1360 3112.1158 3114.7571 3125.4942 3135.6212 3141.3933 3161.3811 3193.4510 3552.5868 3561.6405 3701.2071
redmass: 1.0298 3.7782 4.4112 4.8035 5.2090 4.5523 3.5260 1.2528 4.5858 2.7920 3.8667 4.4679 2.8932 6.1433 3.6999 3.6242 1.0387 1.3797 2.3209 4.2342 3.9323 3.5233 3.0324 4.7466 5.7033 2.2690 5.9567 1.5418 4.9678 3.8370 5.3364 4.4232 3.9631 4.7424 1.4190 5.3958 1.7135 1.3510 6.3827 3.2570 1.4036 1.6086 1.3735 1.3271 2.8871 1.7455 1.4803 1.5413 1.5658 3.3171 1.7383 1.2437 1.6367 1.1518 3.2159 1.9679 3.5569 1.5842 2.8796 4.2595 2.5241 2.1096 2.2265 1.4519 2.1372 4.0019 1.0903 1.0468 1.3306 1.0463 2.3069 3.0738 7.5409 4.6666 6.5312 4.4019 3.0767 1.4544 1.0401 1.0380 1.0978 1.0974 1.0872 1.0979 1.0945 1.0894 1.0954 1.0917 1.0951 1.0953 1.0751 1.0451 1.1040
irintensity: 0.2683 0.7802 0.9655 2.8253 4.1969 0.4877 2.1781 2.7815 4.1735 7.6969 2.6471 3.3315 2.1382 6.7997 2.4645 4.8737 40.3309 217.4439 53.4989 9.2987 1.4618 2.5442 5.8244 6.8159 1.3832 23.1769 23.0298 35.3707 1.8634 32.0313 0.6724 14.0637 2.6767 11.5760 13.6695 1.5348 52.1011 43.5056 9.8473 0.6594 0.8316 2.1137 2.4155 3.8161 0.9260 12.0154 7.0739 10.4226 1.0959 14.4068 16.9279 31.1449 7.6557 160.1474 209.7145 13.5936 40.5496 22.0499 134.9118 144.7974 8.0820 37.0445 16.1555 27.5425 99.9967 0.5672 10.0554 12.6536 124.6398 18.6915 748.0670 25.6561 30.3279 18.3370 10.9517 172.8150 91.2803 369.5132 25.3354 38.5579 23.8769 22.7955 23.9703 10.4296 8.0109 22.3812 21.0077 17.9694 6.6661 7.8830 13.5878 128.3048 23.5172
temp: 298.150 k
press: 1.00000 atm
elementType: 8 7 7 7 6 6 6 6 6 6 6 6 6 6 6 6 6 6 1 1 1 1 1 1 1 1 1 1 1 1 1 1 1
symmnumber: 1
zpe: 691281.1 jmol-1
zpe.correction: 0.263295 hartree
zpe.thermalcorrener: 0.279520 hartree
zpe.thermalcorrenthalpy: 0.280464 hartree
zpe.thermalcorrgfe: 0.218577 hartree
zpe.sumelectzpe: -780.718536 hartree
zpe.sumelectthermal: -780.702311 hartree
zpe.sumelectthermalent: -780.701367 hartree
zpe.sumelectthermalfe: -780.763254 hartree
dipole: -5.5935 2.8059 0.0899
dipole: 6.2585
quadrupole: -67.4605 -103.0854 -111.2765
quadrupole: -12.6689 -1.4933 -2.3143
quadrupole: 26.4803 -9.1446 -17.3357 -12.6689 -1.4933 -2.3143
hfenergy: -780.9818313 hartree
pointgroup: C01 [X(C14H15N3O1)]
dipole: 2.1851342 -1.1348065 0.0132116 debye
polarizability: 341.2522192|-15.7761807|176.2000674|5.1145275|6.9085624|82.6465456 unknown
InChI: InChI=1S/C14H15N3O/c1-9-3-8-13(10(2)16-9)17-14(18)11-4-6-12(15)7-5-11/h3-8,17H,15H2,1-2H3
charge 0 multiplicity 1
33 atoms
O  0.359389 2.114625 0.033023
N  -0.363745 -0.11946 0.080485
N  -3.950802 -1.071709 0.056232
N  6.134507 -0.800529 0.019944
C  -1.77213 0.040715 0.037281
C  -2.58897 -1.134397 0.096833
C  2.039739 0.367717 0.021276
C  -2.415288 1.303497 -0.065723
C  -4.573426 0.144268 -0.045327
C  0.629243 0.870663 0.038927
C  -3.821836 1.344216 -0.108699
C  -1.980433 -2.521124 0.206477
C  3.068705 1.295959 0.338358
C  2.422949 -0.95917 -0.319791
C  4.797178 -0.418245 0.01644
C  4.418307 0.919196 0.343862
C  3.77214 -1.35094 -0.324342
C  -6.088257 0.141133 -0.084477
H  -0.038075 -1.080662 0.187937
H  -1.809255 2.210003 -0.105109
H  -4.338275 2.306832 -0.189069
H  -1.339851 -2.766762 -0.664978
H  -1.370984 -2.641727 1.124971
H  -2.798539 -3.255859 0.243792
H  2.772196 2.322901 0.575982
H  1.677212 -1.702148 -0.631463
H  5.191577 1.653946 0.598777
H  4.042969 -2.376034 -0.604493
H  -6.454909 -0.895703 -0.028947
H  -6.515137 0.712562 0.761301
H  -6.469164 0.601924 -1.015364
H  6.408213 -1.75014 -0.215905
H  6.865953 -0.133647 0.24949
