program: Gaussian 09
title: 000210613
version: EM64L-G09RevD.01
frameworkgroup: C1[X(C20H23N)]
method: RPBEPBE
basis: SDD
operation: Freq
keyword: #pfreq=noraman
keyword: PBEPBE/SDD
title: #p freq=noraman PBEPBE/SDD
converged: YES YES NO NO
title: Mulliken charges:
elementType: N C C C C C C C C C C C C C C C C C C C C H H H H H H H H H H H H H H H H H H H H H H H
charge: -0.075445 0.218393 0.120582 -0.694114 -0.577623 0.133307 0.297148 -0.409100 -0.343522 0.309573 -0.414633 -0.428705 -0.248590 -0.240697 -0.377826 -0.399391 -0.628215 -0.616313 -0.250705 -0.251855 -0.248678 0.240588 0.218166 0.232054 0.251406 0.217703 0.236591 0.174093 0.211382 0.242512 0.241806 0.223293 0.223481 0.219435 0.243387 0.182552 0.238263 0.219848 0.224656 0.185498 0.221921 0.224002 0.224835 0.228936
chargesum: 0.00000
title: Mulliken charges with hydrogens summed into heavy atoms:
elementType: N C C C C C C C C C C C C C C C C C C C C
charge: -0.075445 0.218393 0.120582 -0.210654 -0.118869 0.133307 0.297148 0.045194 0.041953 0.309573 -0.172121 -0.186899 -0.025297 -0.017216 -0.158391 -0.156004 0.012448 0.015763 -0.026702 -0.027020 -0.019742
polarizability: 2.47888783e+02 -1.37695159e+01 3.41228963e+02 -1.13542904e+01 1.28383947e+00 1.27653189e+02
1716.lowfreq: -12.5638 -7.0406 -0.0006 -0.0003 0.0007 4.8660 11.9424 19.5151 36.7079
frequency: 4.7081 18.7153 36.6991 56.6209 60.5424 89.3325 101.8933 135.7836 150.3636 172.5599 194.0330 227.2972 238.1186 244.0474 266.4040 283.8990 292.5226 317.5687 332.8506 374.9565 407.9749 422.6999 423.7616 448.8696 495.9806 521.2623 538.4168 570.4006 573.9914 616.9142 639.2778 660.1150 700.6216 718.4610 735.4210 752.7908 769.1378 774.2012 786.3591 819.7627 842.6128 849.4297 865.6848 881.6728 910.4016 924.7633 954.1828 973.6508 982.1605 986.9270 992.7712 1002.8373 1011.7962 1020.0961 1025.7849 1033.1665 1036.5929 1066.9651 1073.1450 1081.2499 1092.8692 1102.1441 1111.3928 1126.9008 1133.7977 1158.6495 1168.2431 1173.1198 1191.4447 1198.6135 1207.4684 1213.5603 1254.9347 1262.6425 1270.8075 1282.8246 1293.7781 1309.9889 1315.7596 1329.3007 1359.4640 1371.6735 1374.6787 1401.3870 1417.7176 1419.5463 1434.2193 1441.7545 1449.6465 1458.9509 1462.4034 1464.4102 1474.1232 1476.6259 1479.0677 1484.7941 1487.2441 1492.6113 1572.8321 1585.8837 1599.9841 1609.3152 1617.7858 2808.3413 2837.5677 2855.4124 2965.1926 2976.3040 2988.7632 3000.7822 3016.5194 3021.1487 3027.1240 3030.5726 3058.1216 3075.3487 3088.8916 3119.1857 3121.9873 3127.0034 3129.1425 3140.5624 3144.0327 3157.4123 3159.2607 3168.9131
redmass: 2.4925 4.1362 3.7487 4.1136 4.0076 3.1191 3.4418 3.2919 2.1880 3.7422 3.8252 1.4254 1.3041 1.4562 3.6766 4.8085 2.7290 2.9459 2.2706 3.5870 2.8665 2.4522 3.0138 2.7060 3.2235 3.3086 3.8870 4.6143 4.9329 6.3122 4.2221 5.6098 1.7149 3.2234 1.9479 1.2330 1.8932 2.1622 2.9135 4.3427 1.7889 1.5930 1.3628 1.8763 1.5383 1.6759 1.6759 1.4258 1.3207 4.5649 1.3541 3.4524 3.1012 2.2629 2.5005 1.7621 1.9360 2.5294 1.9403 2.0862 1.4217 1.7431 1.9778 1.1992 1.4542 1.6042 1.1172 1.0589 1.4550 1.3022 1.7823 1.7236 1.8234 2.2276 1.8144 1.3056 1.2214 1.7625 1.5862 1.4283 2.9189 1.4152 6.3973 3.4966 1.1447 1.2556 2.3560 1.1600 2.5287 1.0562 1.1030 2.5637 1.0680 1.2084 1.0631 1.1225 1.8034 1.1149 5.7520 6.7090 8.0662 6.0929 7.0743 1.0703 1.0579 1.0577 1.0631 1.0612 1.0673 1.0784 1.0717 1.0977 1.0955 1.0716 1.1027 1.1010 1.1000 1.0853 1.0844 1.0891 1.0878 1.0944 1.0933 1.0959 1.1001 1.0985
irintensity: 0.5677 0.0186 0.2740 0.1511 0.0443 1.0451 0.3010 0.0092 0.4688 0.2415 0.1540 1.6046 1.0941 4.5908 2.2008 1.3387 1.0543 4.6658 6.7707 1.9109 0.1164 2.0135 2.2336 5.7180 4.5826 2.0606 10.3419 2.0763 1.5421 0.4080 1.4255 2.7142 47.6578 5.0177 30.8704 4.1973 66.0917 37.5404 5.3211 15.2472 0.7980 0.6255 0.5059 1.0662 1.5561 1.3134 3.5833 0.1713 0.1422 0.7984 0.1397 1.1057 17.4330 8.9653 3.5532 19.9842 8.7020 27.8852 0.5002 6.3722 6.1233 7.1272 3.7173 2.4186 3.7236 4.7196 2.2003 0.1430 2.4548 0.9947 14.9085 11.7744 2.8746 2.4343 7.3428 2.1736 9.7651 0.9184 3.5327 1.1088 5.3926 13.0010 0.0886 16.3545 2.3179 10.3117 3.7218 4.0271 4.9656 13.6874 13.5248 10.5304 5.8016 9.4086 17.4205 15.0153 17.6663 22.2389 2.2410 5.2769 5.9720 16.4177 15.6370 75.1044 71.2721 209.9813 19.9522 15.0965 5.1292 47.9355 47.1073 7.8944 2.5121 46.1801 47.7569 36.7986 46.5087 4.4738 5.8928 4.4749 3.1152 36.4855 30.5699 42.8638 40.5819 13.9053
temp: 298.150 k
press: 1.00000 atm
elementType: 7 6 6 6 6 6 6 6 6 6 6 6 6 6 6 6 6 6 6 6 6 1 1 1 1 1 1 1 1 1 1 1 1 1 1 1 1 1 1 1 1 1 1 1
symmnumber: 1
zpe: 978803.6 jmol-1
zpe.correction: 0.372807 hartree
zpe.thermalcorrener: 0.392503 hartree
zpe.thermalcorrenthalpy: 0.393447 hartree
zpe.thermalcorrgfe: 0.321179 hartree
zpe.sumelectzpe: -829.142276 hartree
zpe.sumelectthermal: -829.122580 hartree
zpe.sumelectthermalent: -829.121636 hartree
zpe.sumelectthermalfe: -829.193903 hartree
dipole: 0.1639 1.1303 -0.1082
dipole: 1.1473
quadrupole: -111.6446 -118.9463 -130.1400
quadrupole: 2.7991 -3.0379 1.1299
quadrupole: 8.5990 1.2973 -9.8964 2.7991 -3.0379 1.1299
hfenergy: -829.5150823 hartree
pointgroup: C01 [X(C20H23N1)]
dipole: 0.3884182 0.2237633 -0.0528807 debye
polarizability: 291.5995136|47.9831056|298.3004278|-6.7422247|-2.8621204|126.8709934 unknown
InChI: InChI=1S/C20H23N/c1-21(2)14-8-13-19-18-12-7-6-11-17(18)15-20(19)16-9-4-3-5-10-16/h3-7,9-12H,8,13-15H2,1-2H3
charge 0 multiplicity 1
44 atoms
N  2.855043 -3.637518 0.542672
C  -0.595972 -0.043389 -0.467975
C  -0.633047 1.31833 -0.190025
C  -2.057011 1.726393 0.205353
C  0.556601 -0.887212 -0.962603
C  -1.943239 -0.613308 -0.257641
C  -2.831703 0.424602 0.154836
C  1.197805 -1.769517 0.147033
C  2.379096 -2.596808 -0.399535
C  0.459564 2.308767 -0.244907
C  -2.415157 -1.938141 -0.411223
C  -4.182462 0.152576 0.423846
C  -3.776842 -2.210766 -0.139397
C  -4.654087 -1.178357 0.276907
C  0.177146 3.676369 -0.541521
C  1.818895 1.963347 0.022435
C  3.418084 -3.085278 1.79122
C  3.79151 -4.577408 -0.107228
C  1.201501 4.643495 -0.59589
C  2.84387 2.930435 -0.032361
C  2.544826 4.27643 -0.347271
H  1.333119 -0.247423 -1.421722
H  0.186512 -1.558515 -1.764911
H  -2.482458 2.471276 -0.497315
H  -2.079155 2.19703 1.208279
H  1.525373 -1.11928 0.981059
H  0.44443 -2.463371 0.564634
H  3.208779 -1.900396 -0.702054
H  2.048431 -3.114944 -1.321743
H  -1.74564 -2.743627 -0.733604
H  -4.867041 0.948359 0.740356
H  -4.15964 -3.231849 -0.249566
H  -5.704648 -1.410749 0.48501
H  -0.85461 3.981579 -0.748905
H  2.067353 0.939691 0.317547
H  4.308936 -2.426117 1.61911
H  2.655897 -2.499023 2.33103
H  3.730897 -3.915073 2.449935
H  3.309764 -5.031064 -0.992065
H  4.746518 -4.096092 -0.442703
H  4.049985 -5.39051 0.594901
H  0.95305 5.683907 -0.834861
H  3.877124 2.636102 0.184998
H  3.341804 5.027044 -0.388134
