program: Gaussian 09
title: 000215985
version: EM64L-G09RevD.01
frameworkgroup: C1[X(C6H6ClN3O2)]
method: RPBEPBE
basis: SDD
operation: Freq
keyword: #p
keyword: freq=noraman
keyword: PBEPBE/SDD
title: #p freq=noraman PBEPBE/SDD
converged: YES YES NO NO
title: Mulliken charges:
elementType: Cl O O N N N C C C C C C H H H H H H
charge: 0.010939 -0.214154 -0.243596 -0.132617 -0.086331 0.100257 0.251638 -0.049123 -0.629055 -0.272872 -0.218709 -0.166791 0.261104 0.253174 0.261255 0.277749 0.287124 0.310009
chargesum: 0.00000
title: Mulliken charges with hydrogens summed into heavy atoms:
elementType: Cl O O N N N C C C C C C
charge: 0.010939 -0.214154 -0.243596 -0.132617 -0.086331 0.100257 0.251638 -0.049123 0.146478 0.004877 0.068415 0.143219
polarizability: 2.38888699e+02 -4.95781487e-02 1.02849405e+02 -6.13847891e-03 7.47915633e-03 4.39433500e+01
1716.lowfreq: -13.3546 -1.4245 0.0019 0.0022 0.0026 5.7663 47.7859 60.9755 76.1659
frequency: 47.7539 60.8181 76.1654 97.3955 152.9337 183.6289 225.4853 240.3091 259.2281 266.6731 352.3802 401.5718 500.4555 561.1637 615.9315 644.7436 658.6006 670.6250 713.3062 822.6829 825.6327 866.3373 911.7915 933.5960 972.8061 1079.3043 1094.8593 1121.9549 1187.4518 1208.4378 1220.9883 1262.4329 1269.5923 1326.0299 1364.3094 1387.3058 1423.8677 1458.1845 1469.3675 1479.9103 1494.5574 1640.4925 3008.5825 3101.2016 3127.4476 3140.2611 3213.8785 3251.6097
redmass: 11.5285 6.9906 8.9083 1.0329 5.3500 2.9097 7.4030 12.1189 6.3638 3.9901 3.6009 7.4024 7.5177 5.0084 4.8607 5.8575 7.7159 6.1478 10.9020 6.0723 1.3197 1.7960 4.5839 4.6651 1.1571 2.5597 2.0195 1.3194 1.7082 3.2402 3.4673 1.8609 3.1167 3.2915 6.0488 3.2657 5.5175 1.3962 2.4222 1.0396 1.5272 6.3821 1.0344 1.1032 1.1004 1.0898 1.0960 1.0997
irintensity: 0.1181 3.1239 3.2127 0.2004 1.6422 4.0475 0.3092 0.2951 0.0976 2.4647 5.8351 15.0095 8.2594 2.4754 7.0203 0.0023 9.3518 6.8630 4.9732 26.3350 29.2341 16.2726 47.3365 21.9619 55.5736 3.5581 20.9845 0.6236 60.0176 421.0702 258.5238 1.4289 3.9678 57.5228 95.5532 62.5079 227.3845 38.9539 5.4041 18.5310 7.7245 202.2531 18.8284 10.6918 2.2135 0.2735 12.4042 1.8522
temp: 298.150 k
press: 1.00000 atm
elementType: 17 8 8 7 7 7 6 6 6 6 6 6 1 1 1 1 1 1
symmnumber: 1
zpe: 319367.3 jmol-1
zpe.correction: 0.121641 hartree
zpe.thermalcorrener: 0.133107 hartree
zpe.thermalcorrenthalpy: 0.134052 hartree
zpe.thermalcorrgfe: 0.082521 hartree
zpe.sumelectzpe: -1006.005416 hartree
zpe.sumelectthermal: -1005.993949 hartree
zpe.sumelectthermalent: -1005.993005 hartree
zpe.sumelectthermalfe: -1006.044535 hartree
dipole: -6.7220 2.1896 0.0000
dipole: 7.0696
quadrupole: -102.4413 -73.0030 -76.1759
quadrupole: -3.7265 -0.0014 -0.0015
quadrupole: -18.5679 10.8704 7.6974 -3.7265 -0.0014 -0.0015
hfenergy: -1006.1270566 hartree
pointgroup: C01 [X(C6H6Cl1N3O2)]
dipole: 2.6000454 0.9878618 0.0000805 debye
dipolederiv: -0.8448753 -0.1390101 -0.0002509 -0.4104174 -0.1593292 0.0000323 0.000023 0.0001012 0.0198362 -1.0709269 -0.2410948 -0.0001537 -0.2745408 -0.5619034 0.0003122 -0.0001548 0.0003211 -0.2436768 -0.6597458 0.0847571 -0.0003867 0.5155614 -0.8089061 0.0011842 -0.0010772 0.0009127 -0.2464071 0.3848702 0.0761869 0.0000684 -0.1343721 -0.7440551 0.001165 0.0000172 0.0002026 -0.062425 0.2943621 -0.0726199 0.0002973 -0.4975654 -0.4133849 0.0000189 0.0010759 0.0001969 -0.2413793 2.3273033 0.0240345 0.0013192 -0.6192932 1.1076225 -0.001781 0.0024399 -0.0013939 0.192429 -0.7621887 0.2343376 -0.0007255 0.6625655 0.2565027 0.0000657 -0.0016504 -0.0001044 0.0450958 0.8647238 0.0194734 0.0004129 1.37434 0.4686631 -0.0000682 -0.0011132 -0.0005223 -0.0590344 0.081615 -0.0266265 -0.0000069 0.0401983 0.4156362 -0.00094 -0.0001709 -0.0005806 0.2006974 -0.8003544 -0.0834559 -0.0002096 -0.6642482 0.1003762 -0.0006392 0.000575 -0.0002722 -0.0915015 1.353675 -0.1021107 0.0010189 0.0552226 -0.0059296 -0.0001819 0.0008683 -0.0001904 -0.0726884 -1.5285078 0.1460331 -0.0010966 -0.1588074 0.0729123 -0.0003562 -0.0008212 -0.0001661 -0.1082923 0.0772777 0.0682889 0.0893178 -0.0115231 0.0186922 -0.0074994 0.0629897 -0.053242 -0.0192671 -0.028006 -0.1059677 -0.0009328 -0.0020377 0.0756151 0.0002334 -0.0007053 -0.0000558 0.1340551 0.0787049 0.0671882 -0.0884126 -0.0119564 0.0179662 0.0077297 -0.0620204 0.0541437 -0.0212387 0.0535906 0.0381422 -0.0001236 0.0539076 0.0624336 0.0002048 -0.0001534 0.0001939 0.188837 0.1261342 0.0087174 -0.0000311 0.0018558 0.0197364 0.0002763 0.0001009 0.0002504 0.1769156 0.0523482 0.0037262 -0.0001045 0.0811106 0.0773517 0.0002433 -0.0002231 0.0002053 0.2080445 unknown
polarizability: 238.5680467|6.596553|103.1698472|0.1017827|-0.0933067|43.9435607 unknown
InChI: InChI=1S/C6H6ClN3O2/c1-9-5(7)4-8-6(9)2-3-10(11)12/h2-4H,1H3
charge 0 multiplicity 1
18 atoms
Cl 4.348354 0.454938 0.00223
O  -4.31039 -0.89349 -0.000942
O  -3.496452 1.25015 -0.003645
N  1.56563 0.634659 0.000784
N  0.856145 -1.538407 0.003451
N  -3.334882 -0.038902 -0.001574
C  0.451634 -0.231374 0.001333
C  2.688359 -0.190437 0.002321
C  1.538339 2.1061 -0.001743
C  2.239308 -1.520911 0.004086
C  -0.90742 0.24016 -0.000297
C  -1.9908 -0.59196 0.000222
H  1.019749 2.482972 0.89557
H  2.570575 2.487118 0.003118
H  1.029045 2.480285 -0.905524
H  2.834286 -2.42965 0.005713
H  -1.104263 1.319276 -0.002191
H  -1.953213 -1.681631 0.001889
