program: Gaussian 09
title: 000216020
version: EM64L-G09RevD.01
frameworkgroup: C1[X(C19H25NO)]
method: RPBEPBE
basis: SDD
operation: Freq
keyword: #p
keyword: freq=noraman
keyword: PBEPBE/SDD
title: #p freq=noraman PBEPBE/SDD
converged: YES YES NO NO
title: Mulliken charges:
elementType: O N C C C C C C C C C C C C C C C C C C C H H H H H H H H H H H H H H H H H H H H H H H H H
charge: -0.449586 -0.056543 0.174395 -0.282621 -0.491642 -0.458869 0.336113 0.487067 -0.715955 -0.380075 -0.391509 -0.429983 -0.325645 -0.617388 -0.640851 -0.263525 -0.234391 -0.247749 -0.260322 -0.241809 -0.249627 0.265942 0.243616 0.198871 0.209976 0.204217 0.239993 0.212897 0.215470 0.335485 0.220223 0.290602 0.249669 0.230724 0.223374 0.184211 0.224514 0.217679 0.181640 0.255777 0.223277 0.227588 0.218457 0.217366 0.227951 0.220996
chargesum: 0.00000
title: Mulliken charges with hydrogens summed into heavy atoms:
elementType: O N C C C C C C C C C C C C C C C C C C C
charge: -0.114101 -0.056543 0.174395 -0.016679 -0.049155 -0.044676 0.336113 0.487067 -0.047595 -0.159852 -0.100907 -0.180314 -0.094921 0.014712 0.014245 -0.040248 -0.006802 -0.029292 -0.042956 -0.013858 -0.028631
polarizability: 1.93690959e+02 -5.64593856e+00 2.31942450e+02 2.45689486e+01 5.10587415e+00 1.94972900e+02
1716.lowfreq: -14.7266 -9.7438 -4.8413 -0.0009 -0.0001 0.0006 29.3411 49.3183 50.4321
frequency: 28.9603 49.2009 50.3327 56.0571 67.6186 73.3378 91.6255 128.4332 145.7653 167.7472 195.0170 223.2751 234.6354 240.5983 242.3636 249.0105 253.8898 294.5241 304.0048 321.2108 327.5520 338.0208 352.1312 404.3986 407.8774 427.3538 442.7731 460.7287 494.4049 542.0219 554.4070 606.0310 615.1283 617.4721 633.0909 698.0359 705.0802 710.3608 756.7812 767.3483 783.5846 790.6254 826.3701 846.1493 857.5693 904.9016 907.3752 931.6917 948.8632 964.3417 968.6318 981.2378 984.7284 987.1178 989.6455 994.3173 1001.2544 1024.0395 1030.0671 1031.8566 1036.8040 1064.4539 1069.1695 1082.7966 1089.0652 1094.8945 1109.9773 1117.1028 1134.6223 1166.2569 1170.0206 1172.1860 1191.3277 1193.3199 1194.8531 1216.0761 1244.0719 1263.4758 1274.8128 1288.5189 1309.2586 1319.6529 1323.5599 1343.6670 1355.1892 1375.2952 1377.1192 1385.5918 1388.8231 1418.0781 1431.6423 1439.2937 1443.1309 1461.5699 1464.8116 1470.9221 1474.7131 1477.0752 1478.9094 1481.5748 1486.2669 1490.5986 1496.3553 1585.7903 1591.8469 1609.2619 1613.0957 2827.1214 2830.0850 2850.4960 2974.0748 2983.0950 2994.6180 3012.3397 3013.6307 3028.3634 3037.1335 3071.3907 3074.4636 3084.3434 3091.5402 3116.4248 3120.9393 3126.9502 3131.0051 3141.7067 3144.8205 3153.2581 3156.1084 3165.2403 3167.6257 3538.6821
redmass: 4.6603 3.7368 4.3111 3.0757 3.3308 3.3267 3.5080 3.4097 2.6146 3.1687 2.2419 1.6891 2.3298 1.7404 1.7210 1.6884 2.0522 3.0045 3.1392 1.9652 1.7702 2.2475 2.5502 2.7814 2.7889 2.5071 4.9280 2.7759 3.4875 3.5405 3.4076 3.4073 6.3752 6.0963 4.2169 2.5098 2.1369 1.6569 2.2313 1.9330 2.3142 1.8267 3.2437 1.2614 1.2465 1.9256 1.7748 1.5836 2.5401 2.1641 1.4329 1.4459 2.2835 1.4325 4.4886 4.4211 1.3503 2.2048 2.2240 2.1024 1.5776 2.0753 1.9498 2.4682 1.3705 1.4328 1.7950 2.2294 1.4679 2.0959 1.0606 1.0723 1.7641 1.2458 1.1734 2.3948 1.3679 2.4564 1.7060 1.4899 1.3896 1.3312 1.3558 1.4548 1.4548 1.6612 3.3515 2.2322 1.7771 1.1427 2.2214 1.7396 1.3268 1.0522 1.0564 1.0765 1.0745 1.0910 2.0111 1.0986 1.8754 1.1113 1.0666 6.0158 5.9219 6.0687 5.9899 1.0684 1.0580 1.0597 1.0641 1.0371 1.0827 1.0837 1.0722 1.0706 1.0943 1.0991 1.1009 1.1006 1.0996 1.0841 1.0845 1.0882 1.0881 1.0933 1.0928 1.0966 1.0961 1.0985 1.0989 1.0655
irintensity: 0.0700 0.0345 0.0253 0.4435 0.5417 0.8235 0.3096 0.5479 0.0977 0.3882 0.0640 1.2114 0.1710 0.3571 0.1576 1.1893 5.7012 21.9115 2.1172 31.4285 81.5734 14.7770 0.1041 1.0349 2.2505 0.4668 11.5109 0.9565 0.9699 7.7375 6.0135 32.5379 0.3183 2.1659 7.6446 21.6685 36.2687 97.9782 9.5879 7.4987 30.4703 8.8797 11.2810 0.7543 0.3772 10.2740 36.4619 9.8869 20.4371 7.1969 0.8945 0.2317 0.7101 0.1176 0.8434 0.9698 0.2845 25.7705 7.8446 12.3043 20.1252 9.2382 10.9793 4.7737 5.0954 11.6651 11.1135 3.3817 11.8201 6.2606 0.0280 0.2881 2.3235 7.8124 0.3928 0.9601 23.5117 15.3102 3.3485 17.0933 9.0497 4.6022 15.7898 13.2186 2.1275 1.3388 1.6914 9.2870 8.2040 6.3388 9.0338 6.2460 2.4504 20.3511 3.4117 10.9631 2.4754 11.9231 12.2788 22.3067 23.5716 8.8944 4.4830 0.8235 0.4919 2.1297 2.6650 66.5573 73.8336 287.2451 35.5196 32.8114 2.5289 23.2139 57.5067 32.6684 15.5965 58.2295 30.3998 39.8977 22.2956 0.3345 0.9180 8.8961 6.3387 35.7489 35.2300 44.6094 23.5328 9.0134 9.5998 4.2499
temp: 298.150 k
press: 1.00000 atm
elementType: 8 7 6 6 6 6 6 6 6 6 6 6 6 6 6 6 6 6 6 6 6 1 1 1 1 1 1 1 1 1 1 1 1 1 1 1 1 1 1 1 1 1 1 1 1 1
symmnumber: 1
zpe: 1029597.9 jmol-1
zpe.correction: 0.392153 hartree
zpe.thermalcorrener: 0.413267 hartree
zpe.thermalcorrenthalpy: 0.414211 hartree
zpe.thermalcorrgfe: 0.342512 hartree
zpe.sumelectzpe: -867.392619 hartree
zpe.sumelectthermal: -867.371505 hartree
zpe.sumelectthermalent: -867.370561 hartree
zpe.sumelectthermalfe: -867.442259 hartree
dipole: -1.0284 -2.0296 -0.5868
dipole: 2.3497
quadrupole: -123.3466 -119.6359 -121.8444
quadrupole: -3.0607 1.0445 1.4085
quadrupole: -1.7376 1.9730 -0.2354 -3.0607 1.0445 1.4085
hfenergy: -867.7847718 hartree
pointgroup: C01 [X(C19H25N1O1)]
dipole: -0.4825069 -0.7640902 -0.1948713 debye
polarizability: 193.8471351|-0.9791583|232.8155525|25.0141115|1.3835547|193.9436217 unknown
InChI: InChI=1S/C19H25NO/c1-4-19(21,17-13-9-6-10-14-17)18(15-20(2)3)16-11-7-5-8-12-16/h5-14,18,21H,4,15H2,1-3H3
charge 0 multiplicity 1
46 atoms
O  -0.633348 -0.326295 2.394746
N  2.393529 -1.326302 -1.389206
C  -0.637652 -1.020455 1.076394
C  0.821192 -0.742877 0.522087
C  1.085615 -1.58628 -0.752853
C  -0.895137 -2.534674 1.355929
C  -1.741089 -0.411537 0.187231
C  1.118355 0.74899 0.349133
C  0.122324 -3.193263 2.310119
C  -2.409957 -1.156995 -0.820095
C  -2.107049 0.949606 0.367899
C  1.581559 1.498856 1.460776
C  0.947183 1.419652 -0.888309
C  2.527617 -2.056979 -2.662991
C  3.544689 -1.536922 -0.493283
C  -3.415714 -0.564009 -1.616549
C  -3.113559 1.542349 -0.424669
C  1.855862 2.880452 1.347182
C  1.221731 2.79983 -1.008843
C  -3.7749 0.788583 -1.421132
C  1.676606 3.538186 0.1082
H  1.479141 -1.113965 1.331354
H  0.300592 -1.375534 -1.505445
H  0.990883 -2.671081 -0.482857
H  -1.911748 -2.613882 1.794044
H  -0.928532 -3.105113 0.40972
H  0.235927 -2.59507 3.230804
H  -0.216509 -4.206884 2.592035
H  1.119904 -3.295849 1.844754
H  -1.554169 -0.370268 2.761963
H  -2.159897 -2.209871 -0.988552
H  -1.583637 1.539881 1.126155
H  1.703611 0.995738 2.426294
H  0.610465 0.862517 -1.76769
H  1.694413 -1.78725 -3.337445
H  2.523564 -3.171926 -2.541971
H  3.473475 -1.772891 -3.157741
H  4.47912 -1.355773 -1.05321
H  3.591384 -2.574012 -0.067982
H  3.513642 -0.817769 0.342823
H  -3.920134 -1.160686 -2.385325
H  -3.374483 2.5953 -0.268945
H  2.209559 3.44017 2.220968
H  1.08472 3.298021 -1.975703
H  -4.556872 1.247708 -2.036502
H  1.893223 4.608674 0.012984
