program: Gaussian 09
title: 000215990
version: EM64L-G09RevD.01
frameworkgroup: C1[X(C8H7Br2NO3S)]
method: RPBEPBE
basis: SDD
operation: Freq
keyword: #p
keyword: freq=noraman
keyword: PBEPBE/SDD
title: #p freq=noraman PBEPBE/SDD
converged: YES YES NO NO
title: Mulliken charges:
elementType: Br Br S O O O N C C C C C C C C H H H H H H H
charge: 0.089883 0.093757 1.012147 -0.522810 -0.467347 -0.229597 -0.594196 -0.036071 -0.196785 -0.257355 -0.215161 -0.200783 0.454595 -0.209938 -0.821604 0.376792 0.304194 0.292976 0.248618 0.247352 0.242414 0.388919
chargesum: 0.00000
title: Mulliken charges with hydrogens summed into heavy atoms:
elementType: Br Br S O O O N C C C C C C C C
charge: 0.089883 0.093757 1.012147 -0.522810 -0.467347 -0.229597 -0.217404 -0.036071 0.107409 0.035621 0.033457 0.046569 0.454595 0.032476 -0.432685
polarizability: 1.79157140e+02 3.50015335e+01 1.54860772e+02 6.79624537e+00 -3.69931273e+00 1.40736217e+02
1716.lowfreq: -8.3726 -5.6885 -2.0672 0.0012 0.0015 0.0021 4.3472 22.4180 39.3769
frequency: -6.2202 22.3687 39.3298 64.9595 78.8826 96.2037 119.0939 144.7744 151.1350 162.3321 220.9214 248.2265 250.3300 302.8478 334.4610 353.9274 402.5086 422.8036 456.8514 509.7103 521.9077 540.2978 599.5910 645.9270 652.0619 681.8089 700.3355 734.5136 761.5117 823.1525 840.2529 918.4608 931.3842 970.0866 973.0789 980.8930 1005.9572 1006.3931 1043.2882 1081.7200 1134.5177 1153.5714 1175.5117 1182.5890 1192.4597 1309.1698 1347.9644 1383.5220 1439.6178 1451.4528 1572.0184 1597.4085 1603.4914 3142.9267 3147.7950 3154.7665 3164.3984 3175.0158 3185.9572 3491.0185
redmass: 12.9625 8.4052 5.1994 8.7152 15.2978 8.4943 15.6573 7.6216 9.8568 16.2721 10.3186 8.6766 7.2977 12.7384 8.7937 8.9395 2.7952 9.6046 5.1514 3.0824 1.9473 4.2029 6.4874 5.5890 6.9933 2.3748 5.6300 7.3624 1.4340 15.3793 1.2513 7.0845 1.3585 10.3300 5.3957 1.4968 4.0177 1.4026 2.0799 1.5678 1.7153 1.0620 1.0589 1.1214 1.2311 1.2875 2.6075 7.9848 2.2895 1.9795 5.7518 9.6484 6.9923 1.0864 1.0883 1.0894 1.0939 1.0985 1.0985 1.0795
irintensity: 0.6539 0.8676 0.6854 0.6580 0.6685 5.9294 2.5811 1.9264 2.0842 6.0131 2.2224 6.8323 0.5104 4.4596 25.2981 7.5945 0.1290 24.8193 25.6702 112.4116 31.8706 244.3548 0.7389 34.1970 0.6901 15.7465 149.2705 39.5644 76.9899 85.3601 1.2314 17.3761 2.8117 66.1167 1.4515 2.6221 0.2202 0.0569 24.3904 4.1925 33.9228 31.1305 0.5577 10.0154 34.5978 4.5478 243.1493 8.3779 20.5995 14.7802 2.9761 203.7372 5.2648 2.0249 2.5593 9.7569 3.3818 10.3323 12.6342 64.7996
temp: 298.150 k
press: 1.00000 atm
elementType: 35 35 16 8 8 8 7 6 6 6 6 6 6 6 6 1 1 1 1 1 1 1
symmnumber: 1
zpe: 363661.5 jmol-1
zpe.correction: 0.138511 hartree
zpe.thermalcorrener: 0.153650 hartree
zpe.thermalcorrenthalpy: 0.154594 hartree
zpe.thermalcorrgfe: 0.092813 hartree
zpe.sumelectzpe: -1013.170053 hartree
zpe.sumelectthermal: -1013.154914 hartree
zpe.sumelectthermalent: -1013.153970 hartree
zpe.sumelectthermalfe: -1013.215752 hartree
dipole: 2.3576 4.4220 -0.1873
dipole: 5.0147
quadrupole: -95.3025 -122.7324 -113.6431
quadrupole: 15.7454 2.0640 -1.2123
quadrupole: 15.2569 -12.1731 -3.0837 15.7454 2.0640 -1.2123
hfenergy: -1013.3085645 hartree
pointgroup: C01 [X(C8H7Br2N1O3S1)]
dipole: -1.0294505 1.6806075 0.0906044 debye
dipolederiv: -0.1491557 0.0846243 0.0342939 -0.0129214 -0.509366 -0.2521963 -0.0270011 -0.3805011 -0.238969 -0.483876 0.2714884 -0.05651 0.3694059 -0.4042387 0.0302653 -0.1787256 0.1086395 -0.0577221 2.4128121 0.2234098 0.1418016 0.2552405 1.7245289 -0.0373728 0.2544769 0.0241259 1.1309213 -0.682456 0.0054598 -0.0644343 0.0091749 -0.5729767 0.0390667 0.0959764 0.1841051 -0.5853612 -0.634557 0.0722409 -0.0086521 0.0008288 -0.6225184 -0.0410773 -0.1036885 -0.1322955 -0.4851581 -0.6124005 -0.0077196 -0.2515941 -0.2610643 -0.3396227 0.0433451 0.2137057 0.2796379 -0.7345461 -1.3766055 -0.3923969 0.1320663 -0.5228608 -0.8604113 0.1215924 0.3468295 0.2221503 -0.6133711 -0.0417095 -0.1314332 0.0234268 -0.1175805 -0.1468965 -0.0089051 0.0376516 -0.0572711 -0.0554319 -0.1159544 0.0564039 -0.1495785 0.0523633 -0.1057729 0.1051685 0.114614 -0.0916445 -0.0671295 -0.1225989 -0.0165882 0.0810985 0.0672629 -0.110528 -0.0892928 -0.2323361 0.1341182 -0.0897954 -0.1241338 -0.0206703 0.0601925 -0.008659 -0.0821575 -0.1405381 -0.027705 -0.033696 0.1099901 -0.0401632 -0.0507552 -0.1563054 -0.0683113 -0.0750308 0.1027996 -0.0631415 0.018724 -0.0029878 0.942842 0.3509426 0.2296217 0.8475953 0.4465108 -0.1666339 -0.9153273 -0.7205174 0.8462146 0.0193397 -0.1403467 0.0112665 -0.1286237 0.0230614 -0.0457245 0.0210256 -0.0478347 0.0188723 0.4500074 -0.5695747 -0.0171446 -0.6506209 1.0214851 0.2486882 0.3191365 0.3783234 0.3287266 0.1318755 -0.0819166 -0.0226815 -0.1542668 0.2063311 0.0254198 0.0352561 0.0327749 0.2299558 0.1486696 0.031733 0.0637249 0.0283847 0.1217397 -0.0119635 0.0585098 -0.0049531 0.1384579 0.1749045 0.0156774 -0.0202347 -0.007711 0.1290807 0.0483592 -0.0032504 0.0218524 0.0613687 0.0978588 0.0497431 -0.0021418 0.0641795 0.0940208 0.0656025 -0.0134098 0.0606195 -0.050483 0.0355205 0.0860805 0.0709012 0.1016452 0.0891978 -0.0214227 0.0757718 -0.0247074 0.0129072 0.0266775 0.1157791 -0.0289805 0.1254399 0.0352282 0.0447354 -0.0270586 0.0416222 0.0901146 -0.0568971 0.0478187 -0.0701363 0.011099 -0.0616649 -0.0599157 0.0186901 -0.0132723 0.0134259 unknown
polarizability: 178.8231542|-35.0575709|151.2322356|10.0181308|-2.2756984|144.6987394 unknown
InChI: InChI=1S/C8H7Br2NO3S/c9-7(10)8(12)11-15(13,14)6-4-2-1-3-5-6/h1-5,7,11H
charge 0 multiplicity 1
22 atoms
Br 2.984072 2.092752 1.832424
Br 4.534291 -0.780236 1.124959
S  -0.366232 -1.63342 0.590622
O  -0.730361 -2.183255 2.072367
O  -0.094775 -2.633459 -0.644698
O  1.507768 0.25142 -1.158855
N  1.217204 -0.677408 0.967459
C  -1.58688 -0.283435 0.093647
C  -1.623363 0.118199 -1.250391
C  -2.431629 0.203791 1.103828
C  -2.58434 1.0958 -1.597269
C  -3.381863 1.181378 0.728874
C  1.909536 0.035248 0.019396
C  -3.454079 1.623772 -0.613471
C  3.258281 0.634254 0.46451
H  1.599272 -0.901285 1.895316
H  -0.931178 -0.302291 -1.984637
H  -2.359933 -0.175753 2.128055
H  -2.64685 1.442913 -2.633278
H  -4.062923 1.58889 1.482626
H  -4.194204 2.380517 -0.894524
H  3.737785 1.110004 -0.400461
