program: Gaussian 09
title: 000210605
version: EM64L-G09RevD.01
frameworkgroup: C1[X(C7H8N2O3)]
method: RPBEPBE
basis: SDD
operation: Freq
keyword: #pfreq=noraman
keyword: PBEPBE/SDD
title: #p freq=noraman PBEPBE/SDD
converged: NO YES NO NO
title: Mulliken charges:
elementType: O O O N N C C C C C C C H H H H H H H H
charge: -0.225519 -0.257200 -0.202017 -0.400969 -0.406700 -0.396143 -0.471210 -0.397100 0.221258 0.130103 0.148673 0.175208 0.216897 0.231991 0.241740 0.250591 0.216927 0.225303 0.330501 0.367669
chargesum: 0.00000
title: Mulliken charges with hydrogens summed into heavy atoms:
elementType: O O O N N C C C C C C C
charge: -0.225519 -0.257200 -0.202017 -0.070469 -0.039031 0.052745 0.021121 0.045129 0.221258 0.130103 0.148673 0.175208
polarizability: 1.29620210e+02 6.05870821e+00 1.13770367e+02 1.60865853e+00 -1.34273257e+00 5.33597995e+01
1716.lowfreq: -5.2968 0.0002 0.0006 0.0008 6.3212 13.2626 83.3910 107.8146 162.7868
frequency: 83.2492 107.8120 162.7631 174.8992 243.8633 281.3013 331.3758 348.3653 417.6789 431.2664 461.4293 476.4957 504.9695 546.6074 610.1882 646.8507 658.8335 716.9661 752.3066 768.1458 831.6983 855.0466 879.0385 911.0184 993.3020 1066.3154 1084.8048 1105.0606 1127.8915 1176.3863 1191.2307 1215.1389 1262.4201 1265.2407 1322.6782 1332.6471 1346.5775 1367.0836 1380.9630 1455.0401 1466.6294 1475.8621 1515.3117 1629.9371 1657.4803 1710.3287 2929.2848 2980.0883 3012.0611 3039.6626 3052.6012 3080.3890 3526.6051 3568.7295
redmass: 3.8984 5.1174 4.1682 6.7144 5.6565 1.9477 5.4279 8.5715 6.6397 2.5504 1.3147 5.4439 6.9630 3.4164 6.7149 3.5326 4.2634 3.4020 5.9565 2.0173 4.1253 1.5763 2.2235 2.9159 2.3594 1.9433 4.3104 2.4321 3.9053 1.4548 1.3562 3.2247 1.4173 2.4310 1.8637 1.3591 1.3683 1.6217 2.0519 1.0997 1.1303 1.1677 2.2311 7.1550 8.3966 8.9447 1.0705 1.0636 1.0636 1.0948 1.0914 1.1041 1.0770 1.0778
irintensity: 0.3704 4.8684 0.9643 10.8064 2.4452 11.5374 11.0684 12.2035 9.5080 15.6947 91.7181 3.7029 1.0366 1.1090 2.6370 10.1540 0.5315 24.1854 18.0517 126.8598 26.8309 3.3707 17.2303 29.0683 15.7105 7.9809 10.8892 13.7212 48.0689 19.8760 11.8946 30.0297 13.6911 113.2289 34.7003 78.6742 41.9619 23.4272 100.5852 10.4308 12.5777 4.9602 23.3088 387.0604 306.1377 505.3045 82.7295 22.6843 19.7267 15.8518 43.9897 36.1879 62.6836 65.7843
temp: 298.150 k
press: 1.00000 atm
elementType: 8 8 8 7 7 6 6 6 6 6 6 6 1 1 1 1 1 1 1 1
symmnumber: 1
zpe: 397997.1 jmol-1
zpe.correction: 0.151589 hartree
zpe.thermalcorrener: 0.161541 hartree
zpe.thermalcorrenthalpy: 0.162485 hartree
zpe.thermalcorrgfe: 0.116251 hartree
zpe.sumelectzpe: -605.853166 hartree
zpe.sumelectthermal: -605.843214 hartree
zpe.sumelectthermalent: -605.842270 hartree
zpe.sumelectthermalfe: -605.888504 hartree
dipole: 5.2459 0.0823 0.2183
dipole: 5.2511
quadrupole: -67.6293 -78.7138 -68.7602
quadrupole: -8.0434 0.9201 0.7487
quadrupole: 4.0718 -7.0127 2.9409 -8.0434 0.9201 0.7487
hfenergy: -606.0047552 hartree
pointgroup: C01 [X(C7H8N2O3)]
dipole: 2.0643198 -0.0088636 0.0811839 debye
dipolederiv: -1.367941 -0.4459288 0.0249889 0.465627 -0.4423081 0.0146366 -0.0481747 0.0038435 -0.1589145 -0.5305978 0.0261255 -0.0040756 0.0347571 -1.2880551 0.0393737 -0.0089352 0.0457758 -0.3717595 -1.4807696 -0.426445 0.005598 -0.4358242 -0.620762 0.0043541 0.0121401 0.0091755 -0.3624194 -1.1105933 -0.4048597 -0.0232062 -0.2105974 -0.4368351 0.0139511 0.1411691 0.0831886 -0.5045178 -0.7562522 -0.3451727 0.0082135 -0.4567928 -0.8551341 0.0149802 0.0136084 0.0204429 -0.3362854 0.0827611 -0.0456019 0.0109172 0.069583 -0.0192301 -0.0192082 -0.0279473 -0.0369321 0.1061389 -0.1309015 -0.0575311 0.0078441 0.0413885 -0.0216555 -0.0072089 -0.0018228 0.045845 0.1693559 0.6078741 -0.0578761 0.0855998 -0.3582769 0.1391533 -0.0902945 0.0642096 -0.0737593 0.3780175 0.6317752 0.3026992 -0.0160316 -0.5393021 0.5391038 -0.022946 0.0875214 -0.0161366 -0.0810071 0.4728186 0.8469562 -0.0353809 1.0446588 -0.3315123 0.0441132 -0.0823276 0.0252378 0.057272 1.0784739 -0.0883943 0.0231079 0.0479839 1.6676606 -0.0635012 0.004975 -0.0811868 0.2847407 2.2378543 0.5920695 -0.0045811 0.1950182 1.1595 -0.0337213 -0.0008393 -0.0430852 0.3660867 -0.1211251 0.1198897 -0.0188403 0.1231958 0.0148756 0.0139812 -0.0436747 0.0258559 0.0864441 0.0761003 -0.0298179 -0.0294778 -0.0471728 0.0491443 0.0319925 0.0294036 -0.0043322 -0.1441728 0.0390458 0.0852247 -0.0143589 0.0208439 0.0221454 0.0586307 -0.0103836 0.105155 -0.0831359 0.0534813 -0.0147239 -0.0283867 -0.0289904 -0.044804 -0.0795435 -0.0072771 -0.1295884 0.0418459 -0.0317244 -0.0117033 -0.0143085 0.1340565 0.0562451 0.0381435 -0.1581048 -0.0024136 -0.198012 -0.1236703 -0.074534 0.0380071 -0.098352 0.0107946 0.0394784 0.0713029 0.0542139 0.0639152 0.1638674 0.0784068 -0.0154183 0.0317705 0.2239712 -0.0040621 -0.0376411 -0.0408386 0.3421798 0.2095233 -0.048783 -0.0002106 -0.0335748 0.1777023 0.0068503 0.0027981 0.0095388 0.3442276 unknown
polarizability: 129.8673028|5.7415507|113.4961471|1.3462446|-1.9936834|53.3869267 unknown
InChI: InChI=1S/C7H8N2O3/c10-6-5-4(2-1-3-8-5)12-7(11)9-6/h8-9H,1-3H2
charge 0 multiplicity 1
20 atoms
O  -0.961041 -1.416538 0.077886
O  -0.652402 2.69698 -0.104695
O  -3.263186 -1.195623 0.034893
N  1.724579 1.163825 0.008596
N  -1.937893 0.738574 -0.044791
C  2.762058 -1.042697 -0.392295
C  1.475539 -1.769776 0.09141
C  2.917073 0.350757 0.26982
C  0.319941 -0.810604 0.073746
C  0.475704 0.558761 0.016191
C  -0.703471 1.433845 -0.048142
C  -2.147414 -0.648729 0.023054
H  3.648992 -1.658009 -0.1599
H  2.720662 -0.913567 -1.489243
H  1.616995 -2.184487 1.109421
H  1.250901 -2.630769 -0.566028
H  3.081332 0.220321 1.362778
H  3.802284 0.867775 -0.141158
H  1.746308 2.183951 0.013692
H  -2.785562 1.313113 -0.089235
