program: Gaussian 09
title: 000215978
version: EM64L-G09RevD.01
frameworkgroup: C1[X(C12H12N2O)]
method: RPBEPBE
basis: SDD
operation: Freq
keyword: #p
keyword: freq=noraman
keyword: PBEPBE/SDD
title: #p freq=noraman PBEPBE/SDD
converged: YES YES NO NO
title: Mulliken charges:
elementType: O N N C C C C C C C C C C C C H H H H H H H H H H H H
charge: -0.454025 -0.001019 0.009889 -0.221963 -0.553586 0.499316 0.229322 -0.372243 -0.432402 -0.222117 -0.222769 -0.399843 -0.238892 -0.293879 -0.251924 0.214632 0.207155 0.262805 0.259634 0.229062 0.339517 0.223447 0.225599 0.247793 0.226597 0.243765 0.246128
chargesum: 0.00000
title: Mulliken charges with hydrogens summed into heavy atoms:
elementType: O N N C C C C C C C C C C C C
charge: -0.114507 -0.001019 0.009889 -0.007331 -0.083626 0.499316 0.229322 -0.112609 -0.203340 0.001330 0.002830 -0.152050 -0.012294 -0.050114 -0.005796
polarizability: 1.39883899e+02 5.95027726e+00 1.51766961e+02 2.37568255e+01 -1.39434115e+00 1.11242185e+02
1716.lowfreq: -2.1617 0.0011 0.0012 0.0012 7.4471 17.8040 30.6434 37.7450 38.7793
frequency: 29.0463 37.5576 38.7469 96.2464 112.5484 195.5032 213.0085 274.9488 309.1721 331.7596 347.6359 402.5420 402.9887 425.9214 494.7458 551.6099 579.9129 599.4102 616.5981 650.9388 703.0321 750.0984 766.8611 772.0940 826.9721 850.2864 854.1200 918.4375 925.7886 942.5146 960.0466 971.8880 978.2451 982.7187 990.5659 994.6928 1006.3416 1027.2497 1036.5202 1082.5379 1128.7143 1158.0070 1172.2488 1174.2960 1186.5832 1218.0840 1241.9601 1245.1282 1281.8971 1298.8147 1319.3083 1323.9895 1379.4880 1387.8549 1399.3566 1441.6258 1443.6604 1447.8360 1486.2296 1505.7710 1535.2059 1597.1080 1617.3566 2946.2016 2973.9049 3083.6032 3114.5795 3123.9431 3126.3140 3135.3082 3140.0496 3155.6454 3161.5973 3167.4795 3553.2814
redmass: 4.7009 5.0712 4.6457 5.0857 4.4060 3.9389 4.3794 2.7238 1.4221 3.6389 2.1895 3.7729 3.2493 5.8833 4.3932 3.1320 3.8225 8.2606 6.4042 5.7197 1.7432 3.4959 1.9336 2.4844 2.2759 2.3325 1.2600 1.4338 1.4291 2.0845 1.5107 5.2258 1.4075 5.3721 5.9403 1.4119 3.2541 2.1603 2.8551 1.5916 1.6367 1.4661 1.0787 1.5223 1.1228 1.5520 1.9881 4.3917 1.3924 1.4241 1.3131 1.2757 3.0687 2.1546 1.9792 1.7087 1.8872 1.3391 2.4160 7.3173 4.8174 6.1805 6.1464 1.0845 1.0659 1.0958 1.0870 1.0922 1.0869 1.0881 1.0924 1.0963 1.0994 1.0994 1.0660
irintensity: 0.0028 0.0586 0.1833 0.9279 2.8724 0.6392 3.3612 27.8827 124.9656 4.5809 3.7064 8.0114 8.3087 9.2054 0.6445 15.6001 11.0100 3.5663 0.4181 3.2161 55.0305 1.0655 57.0003 15.1165 10.0483 16.2924 0.2557 17.1593 1.5540 9.5144 0.4115 16.6666 1.0340 71.2099 0.5316 3.6810 37.7413 5.0563 2.3143 8.0783 7.7033 72.2531 0.1169 11.9548 4.4988 5.9820 1.2195 2.3312 5.2571 26.0452 8.1338 1.2322 11.4961 14.6444 15.2459 8.3269 28.9724 15.2948 9.0028 8.8498 11.2994 0.5714 2.0924 38.3458 37.6116 7.3030 9.5036 25.0494 2.0243 1.7334 29.7024 25.7883 34.5082 12.3419 9.0100
temp: 298.150 k
press: 1.00000 atm
elementType: 8 7 7 6 6 6 6 6 6 6 6 6 6 6 6 1 1 1 1 1 1 1 1 1 1 1 1
symmnumber: 1
zpe: 560595.7 jmol-1
zpe.correction: 0.213520 hartree
zpe.thermalcorrener: 0.226392 hartree
zpe.thermalcorrenthalpy: 0.227336 hartree
zpe.thermalcorrgfe: 0.172244 hartree
zpe.sumelectzpe: -648.102596 hartree
zpe.sumelectthermal: -648.089723 hartree
zpe.sumelectthermalent: -648.088779 hartree
zpe.sumelectthermalfe: -648.143871 hartree
dipole: -1.1742 0.4476 0.2026
dipole: 1.2728
quadrupole: -93.8270 -72.5710 -90.2049
quadrupole: -2.9435 -0.2892 -1.3157
quadrupole: -8.2927 12.9633 -4.6706 -2.9435 -0.2892 -1.3157
hfenergy: -648.3161154 hartree
pointgroup: C01 [X(C12H12N2O1)]
dipole: 0.4719928 0.1404366 -0.0909234 debye
polarizability: 139.8035305|-4.3590296|152.4949575|23.5142444|-1.462189|110.5945575 unknown
InChI: InChI=1S/C12H12N2O/c15-12(10-4-2-1-3-5-10)8-11-9-13-6-7-14-11/h1-7,9,12,15H,8H2
charge 0 multiplicity 1
27 atoms
O  -1.429577 2.933453 0.119768
N  1.6046 -0.393334 -1.353149
N  3.284179 -0.48304 0.956582
C  -0.562813 1.774579 0.397425
C  0.614194 1.7537 -0.637163
C  -1.434604 0.53069 0.318981
C  1.582187 0.612283 -0.420301
C  -2.45709 0.432388 -0.656033
C  -1.206679 -0.556783 1.195775
C  -3.235766 -0.741108 -0.753909
C  -1.980871 -1.735012 1.09412
C  2.435101 0.5576 0.717589
C  -2.997475 -1.830838 0.116751
C  2.45943 -1.432414 -1.120466
C  3.284469 -1.486341 0.027278
H  -0.133379 1.858366 1.419688
H  1.153908 2.720632 -0.560902
H  0.189684 1.669052 -1.651594
H  -2.650316 1.287742 -1.311034
H  -0.429487 -0.484016 1.967325
H  -0.880503 3.758714 0.121452
H  -4.030043 -0.806288 -1.506272
H  -1.796501 -2.569863 1.779599
H  2.448239 1.36914 1.454406
H  -3.603047 -2.740958 0.039125
H  2.475701 -2.229987 -1.870833
H  3.957556 -2.329857 0.211195
