program: Gaussian 09
title: 000210603
version: EM64L-G09RevD.01
frameworkgroup: C1[X(C12H19ClNO5PS2)]
method: RPBEPBE
basis: SDD
operation: Freq
keyword: #p
keyword: freq=noraman
keyword: PBEPBE/SDD
title: #p freq=noraman PBEPBE/SDD
converged: YES YES NO NO
title: Mulliken charges:
elementType: Cl S S P O O O O O N C C C C C C C C C C C C H H H H H H H H H H H H H H H H H H H
charge: 0.006043 0.946296 -0.208252 0.874510 -0.515606 -0.533142 -0.494094 -0.469831 -0.456125 -0.330635 -0.327926 -0.331858 0.025542 -0.650523 -0.652168 -0.103359 -0.209932 -0.365304 -0.323099 0.389218 -0.474441 -0.475790 0.233252 0.231570 0.258408 0.218416 0.212384 0.263232 0.209265 0.214761 0.219069 0.255746 0.307680 0.287057 0.290587 0.250663 0.241776 0.249150 0.249725 0.241991 0.245745
chargesum: 0.00000
title: Mulliken charges with hydrogens summed into heavy atoms:
elementType: Cl S S P O O O O O N C C C C C C C C C C C C
charge: 0.006043 0.946296 -0.208252 0.874510 -0.515606 -0.533142 -0.494094 -0.469831 -0.456125 -0.330635 0.136896 0.144966 0.025542 0.034359 0.037408 -0.103359 0.097748 -0.078247 -0.032512 0.389218 0.267148 0.261672
polarizability: 3.20656036e+02 -7.88302180e+00 2.15242532e+02 -6.13374165e+00 5.43673514e+00 1.88178381e+02
1716.lowfreq: -5.2390 -3.0169 0.0013 0.0015 0.0018 6.6585 12.5565 20.2961 29.7525
frequency: 9.1329 20.1136 29.7027 38.1956 43.3618 48.7365 55.4749 72.6122 77.2415 102.9323 109.9772 113.6241 118.4145 128.4649 138.5254 147.9186 156.9353 166.8659 171.1328 188.4978 215.6376 218.6756 229.4011 240.5507 247.8955 260.1973 265.1820 282.2761 298.7605 343.4030 355.0638 372.6801 382.0119 396.6781 412.8024 427.6680 444.9651 458.7449 465.4042 497.0334 551.6526 578.2743 601.7331 661.4151 688.0841 695.8480 702.4146 708.7460 744.1469 754.3216 793.7589 819.3182 850.3275 871.8891 884.3295 904.3299 930.4215 955.0539 970.0731 984.0536 990.5295 1005.3344 1060.6599 1073.5397 1079.2202 1082.2597 1112.8164 1113.6594 1132.3572 1133.7794 1143.4714 1160.7213 1178.7566 1188.8605 1241.4343 1276.3120 1302.9231 1343.7011 1353.4760 1372.1498 1382.1732 1387.3444 1392.6118 1423.4306 1424.6286 1439.7723 1440.7506 1449.6110 1457.4559 1458.7455 1465.6283 1468.4329 1469.5639 1472.4593 1485.9233 1489.1770 1573.8594 1582.5341 2978.5651 2987.3503 2988.7739 2989.2406 2991.8355 2994.6790 3032.2455 3060.7487 3080.5650 3085.6213 3094.7586 3097.1308 3109.4613 3116.4270 3136.6039 3139.1881 3144.5373 3174.5425 3186.5465
redmass: 6.0687 5.2845 3.9502 3.9845 5.5081 3.7015 4.5736 2.2719 3.9164 3.6860 1.4008 2.2579 1.2582 2.4675 3.8588 4.5402 5.0167 6.1344 4.7696 2.5319 3.6140 8.2717 2.9908 9.0228 1.6464 4.4264 4.0907 3.1583 8.2755 4.6776 6.2535 5.3587 3.1795 5.5805 7.9214 4.2024 8.9653 3.6462 5.6412 7.2071 7.0827 4.3104 5.3726 8.1404 10.4502 12.7725 4.7928 6.5240 1.9266 1.1927 12.4455 1.6260 1.3274 7.3295 1.5732 2.2256 13.0580 11.3838 11.0689 1.3909 4.9770 2.9565 1.8662 1.7744 1.9775 1.8158 1.2403 1.2425 1.2971 1.3007 1.3607 1.8364 3.2700 3.1428 1.4896 1.2606 1.1488 1.2039 1.1881 4.6403 1.2091 5.4174 1.1977 1.1254 1.1220 1.1515 2.1746 1.0737 1.0512 1.0506 1.0451 1.0515 1.0517 1.0463 1.0467 1.0501 8.1688 6.9506 1.0596 1.0304 1.0373 1.0303 1.0487 1.0517 1.1013 1.0993 1.0981 1.0971 1.1045 1.1048 1.1018 1.1004 1.1037 1.1038 1.0900 1.0956 1.0932
irintensity: 0.7615 0.6362 0.6425 1.9267 0.8885 2.4575 2.3194 0.8299 6.0624 1.3784 0.7091 1.3265 0.2359 4.1896 0.0760 1.2043 1.1837 3.5676 0.4607 2.4270 0.6032 4.2984 6.3693 21.0881 0.8894 6.5876 15.3790 1.3390 3.5812 1.5300 22.6879 15.3191 13.4037 4.6127 31.2909 2.8628 14.8425 19.2213 55.6824 17.4840 57.4047 146.5398 74.2277 27.4500 77.3538 155.7682 59.0704 56.9680 47.3027 2.9071 75.3040 0.4335 22.8075 338.9300 43.9518 6.6569 63.3822 221.0566 148.1484 0.2258 4.9972 44.6486 4.4091 5.2626 11.1917 10.2787 0.7382 0.1102 0.8295 0.6326 5.2813 0.8554 277.5347 27.0016 21.4317 20.2284 15.4141 3.6738 6.3029 14.3324 17.6415 8.8768 45.0982 2.4448 6.8380 10.6261 140.7422 11.0352 13.2552 16.8060 2.2857 21.5446 14.1564 18.6435 12.8407 7.7920 78.8926 122.6342 18.2358 45.0143 23.7561 43.1447 31.4039 25.8827 8.5726 2.5326 54.1684 14.8747 20.1835 20.9977 11.0338 28.2154 12.7996 9.4544 9.7913 1.9101 0.7996
temp: 298.150 k
press: 1.00000 atm
elementType: 17 16 16 15 8 8 8 8 8 7 6 6 6 6 6 6 6 6 6 6 6 6 1 1 1 1 1 1 1 1 1 1 1 1 1 1 1 1 1 1 1
symmnumber: 1
zpe: 791939.6 jmol-1
zpe.correction: 0.301634 hartree
zpe.thermalcorrener: 0.329418 hartree
zpe.thermalcorrenthalpy: 0.330362 hartree
zpe.thermalcorrgfe: 0.239303 hartree
zpe.sumelectzpe: -2495.031739 hartree
zpe.sumelectthermal: -2495.003955 hartree
zpe.sumelectthermalent: -2495.003011 hartree
zpe.sumelectthermalfe: -2495.094070 hartree
dipole: 4.9560 -0.8789 4.1955
dipole: 6.5526
quadrupole: -137.2219 -154.2885 -169.3886
quadrupole: 0.2203 -17.8261 6.8647
quadrupole: 16.4111 -0.6555 -15.7556 0.2203 -17.8261 6.8647
hfenergy: -2495.3333728 hartree
pointgroup: C01 [X(C12H19Cl1N1O5P1S2)]
dipole: 1.9990906 0.5906088 -1.5168747 debye
polarizability: 319.5594564|8.9876324|213.8258255|12.0025393|9.1288324|190.6916662 unknown
InChI: InChI=1S/C12H19ClNO5PS2/c1-5-14(6-2)22(15,16)12-8-7-10(9-11(12)13)19-20(21,17-3)18-4/h7-9H,5-6H2,1-4H3
charge 0 multiplicity 1
41 atoms
Cl -1.594609 -2.75296 -0.923159
S  -2.939302 0.031493 0.594715
S  4.002268 1.282974 -1.889558
P  4.276823 0.231018 -0.143739
O  -3.710537 -1.258712 1.210711
O  -3.004342 1.468602 1.380519
O  3.072893 -0.960934 0.299099
O  4.353797 1.099186 1.340054
O  5.680422 -0.748027 0.001524
N  -3.42988 0.164349 -1.181924
C  -3.049497 1.458265 -1.806793
C  -4.716071 -0.514241 -1.493426
C  -1.074565 -0.315437 0.417786
C  -3.944251 2.695332 -1.559429
C  -6.0094 0.030727 -0.843248
C  -0.549114 -1.47283 -0.185563
C  -0.22868 0.653599 0.98859
C  0.845575 -1.656663 -0.242459
C  1.168016 0.478465 0.951692
C  1.68871 -0.678276 0.328523
C  5.290864 2.248825 1.428446
C  6.124048 -1.549884 -1.165061
H  -2.98656 1.241483 -2.892052
H  -2.015865 1.683292 -1.479376
H  -4.591426 -1.575633 -1.214974
H  -4.784515 -0.471857 -2.598896
H  -3.467346 3.58263 -2.016906
H  -4.057677 2.8815 -0.478333
H  -4.942525 2.580679 -2.014695
H  -6.866961 -0.585057 -1.173412
H  -6.213377 1.078591 -1.116074
H  -5.946895 -0.045432 0.255907
H  -0.688117 1.525448 1.46777
H  1.28008 -2.53956 -0.717352
H  1.842222 1.205813 1.412707
H  5.035429 2.738977 2.378782
H  5.137515 2.942937 0.582034
H  6.331764 1.884738 1.449818
H  7.161928 -1.827748 -0.931495
H  6.08359 -0.949944 -2.092789
H  5.496167 -2.451922 -1.259667
