program: Gaussian 09
title: 000215989
version: EM64L-G09RevD.01
frameworkgroup: C1[X(C14H21NO)]
method: RPBEPBE
basis: SDD
operation: Freq
keyword: #p
keyword: freq=noraman
keyword: PBEPBE/SDD
title: #p freq=noraman PBEPBE/SDD
converged: YES YES NO NO
title: Mulliken charges:
elementType: O N C C C C C C C C C C C C C C H H H H H H H H H H H H H H H H H H H H H
charge: -0.459729 -0.165813 -0.401278 -0.382828 -0.394414 -0.380588 -0.401475 0.463806 -0.225562 0.539470 -0.384334 -0.409070 -0.491499 -0.418604 -0.351838 -0.715015 0.191425 0.223988 0.214504 0.197368 0.206229 0.197288 0.195364 0.205705 0.190886 0.219547 0.224846 0.231949 0.216876 0.229033 0.223773 0.190554 0.210152 0.249962 0.197101 0.221402 0.340820
chargesum: 0.00000
title: Mulliken charges with hydrogens summed into heavy atoms:
elementType: O N C C C C C C C C C C C C C C
charge: -0.118909 -0.165813 0.014135 0.029044 0.009103 0.020481 0.008958 0.463806 -0.000717 0.539470 -0.152385 -0.192194 -0.262466 -0.194831 0.048868 -0.046550
polarizability: 2.46305622e+02 -6.39159357e-01 1.44469232e+02 -4.75951951e+00 -4.77981710e+00 1.12177187e+02
1716.lowfreq: -12.6295 -0.0005 0.0005 0.0007 6.0669 10.6106 27.6346 35.0407 65.1924
frequency: 27.6343 34.7627 65.1235 72.4698 88.6297 134.1765 164.5004 213.7439 219.6953 227.2909 243.2464 249.4295 270.9575 284.5547 359.6043 378.7681 410.4548 412.6665 426.4222 443.5963 472.7731 492.8248 548.9298 593.6416 636.8709 689.9654 737.2759 776.7940 804.2262 809.9228 820.4360 841.2652 850.9589 883.2272 915.5640 918.6217 922.3857 938.2536 952.6228 954.2040 969.2837 997.2214 1013.3975 1021.7787 1063.1508 1083.8642 1090.2947 1114.0083 1127.6094 1129.9843 1134.1951 1154.4135 1196.2445 1209.8222 1211.7688 1228.7731 1235.5461 1240.3660 1264.5220 1273.2484 1287.4143 1324.0356 1333.0095 1336.6342 1345.6382 1349.5155 1351.6010 1358.0797 1373.5672 1377.7158 1383.2202 1401.7059 1424.8081 1453.5547 1462.2823 1465.1839 1466.4848 1469.4404 1476.0423 1480.3339 1483.3843 1512.9845 1565.7804 1627.5689 2869.3397 2877.5128 2933.7521 2967.7489 2979.6689 2984.9472 2985.1946 2986.4017 3005.8466 3036.7634 3044.5239 3050.6738 3055.5579 3072.4538 3086.9584 3097.2936 3111.3946 3116.4347 3147.3223 3157.7511 3572.6546
redmass: 2.9782 4.0569 3.2471 4.0968 3.4919 3.6273 3.2569 2.0580 2.4412 1.2178 1.1422 2.8914 2.9306 2.8012 1.6851 4.5947 3.0495 3.9164 3.5403 2.8825 2.5649 2.0732 2.3370 2.8918 6.7438 3.1729 3.6944 3.5854 1.5012 1.3359 1.7472 2.8592 1.4157 2.4865 2.0638 1.4602 2.8055 1.4114 1.3098 1.3697 5.1373 2.9582 1.7674 2.3503 1.9118 1.5082 1.7432 1.7111 2.0905 2.7534 1.4017 1.2691 1.2340 1.3016 1.3235 2.0723 1.5992 1.4560 1.2600 1.1726 1.7036 1.4467 1.2904 1.3991 1.4040 1.7472 1.6039 1.5114 1.7686 1.2681 2.1716 1.3765 3.2808 1.0936 1.0872 1.0676 1.0955 1.0893 1.0696 1.0954 1.0516 2.6567 6.3951 6.4016 1.0710 1.0724 1.0554 1.0636 1.0393 1.0913 1.0614 1.0610 1.0959 1.0961 1.1007 1.0937 1.1008 1.0980 1.0880 1.1000 1.0891 1.0871 1.0939 1.0933 1.0666
irintensity: 0.8286 0.2494 0.2465 2.3666 4.1280 3.6693 4.4307 1.0720 3.6058 18.9202 117.8697 3.0634 5.5212 15.5767 3.9634 7.0458 0.6463 3.9223 1.1318 1.6257 7.5179 0.1677 28.0489 14.5146 0.1474 0.8787 0.9078 1.1220 3.0767 6.8659 53.8814 0.7121 21.3807 16.3888 6.6605 9.3720 35.8665 2.4103 3.7831 2.9953 138.8422 2.1479 8.3784 15.0278 2.5211 5.7411 2.3711 8.7087 35.8242 6.0180 7.4489 8.7295 21.3424 17.8797 1.8485 27.8405 119.1381 53.2101 1.7721 13.8850 0.8677 0.0882 1.5502 2.6742 1.2528 18.2326 18.2490 3.1197 26.5745 25.8986 14.6904 5.8066 3.6690 7.5813 13.7806 1.6914 46.8179 3.0309 5.9953 12.4185 13.6305 183.7584 5.4249 106.0079 55.0555 129.7414 56.2971 41.3150 31.5593 11.1097 35.8382 37.0306 56.1319 78.9569 43.1794 7.1669 91.5992 43.1169 21.4640 27.6860 20.3440 26.0006 28.2848 12.9407 1.3669
temp: 298.150 k
press: 1.00000 atm
elementType: 8 7 6 6 6 6 6 6 6 6 6 6 6 6 6 6 1 1 1 1 1 1 1 1 1 1 1 1 1 1 1 1 1 1 1 1 1
symmnumber: 1
zpe: 845150.7 jmol-1
zpe.correction: 0.321901 hartree
zpe.thermalcorrener: 0.338024 hartree
zpe.thermalcorrenthalpy: 0.338968 hartree
zpe.thermalcorrgfe: 0.277587 hartree
zpe.sumelectzpe: -674.816055 hartree
zpe.sumelectthermal: -674.799932 hartree
zpe.sumelectthermalent: -674.798988 hartree
zpe.sumelectthermalfe: -674.860368 hartree
dipole: 2.7242 -1.0540 -1.7602
dipole: 3.4104
quadrupole: -94.6832 -91.2376 -97.5271
quadrupole: 6.0577 5.6913 0.5994
quadrupole: -0.2006 3.2450 -3.0444 6.0577 5.6913 0.5994
hfenergy: -675.1379558 hartree
pointgroup: C01 [X(C14H21N1O1)]
dipole: 1.0721427 -0.7478713 -0.3024315 debye
polarizability: 246.3436104|-3.7041216|128.849424|-1.9041458|-16.8664049|127.7590057 unknown
InChI: InChI=1S/C14H21NO/c1-12(11-16)13-5-7-14(8-6-13)15-9-3-2-4-10-15/h5-8,12,16H,2-4,9-11H2,1H3
charge 0 multiplicity 1
37 atoms
O  -5.752912 -0.624393 -0.707158
N  2.141638 0.021314 0.078676
C  2.955694 0.912525 -0.773434
C  2.774318 -1.296371 0.337583
C  4.381276 1.089201 -0.204513
C  4.182486 -1.146688 0.9477
C  5.072469 -0.269487 0.040065
C  0.725252 0.111488 0.02041
C  -3.687154 0.470886 -0.035377
C  -2.162681 0.353297 -0.00327
C  0.054407 0.93982 -0.928854
C  -0.092952 -0.596761 0.954759
C  -1.352581 1.055289 -0.926806
C  -1.494139 -0.479011 0.934572
C  -4.305475 -0.851438 -0.538948
C  -4.297532 0.884148 1.326259
H  3.019285 0.520817 -1.819258
H  2.467349 1.901049 -0.818493
H  2.133037 -1.886115 1.009946
H  2.85568 -1.868798 -0.619411
H  4.314235 1.64226 0.752699
H  4.970959 1.709465 -0.906717
H  4.627926 -2.151281 1.081487
H  4.097418 -0.679631 1.948135
H  5.232602 -0.786397 -0.929212
H  6.069502 -0.120083 0.495114
H  -3.959549 1.244703 -0.780393
H  0.622416 1.483972 -1.688827
H  0.371688 -1.21738 1.727949
H  -1.831279 1.703389 -1.672502
H  -2.075125 -1.028728 1.68548
H  -4.117177 -1.661419 0.199744
H  -3.83569 -1.135857 -1.504218
H  -5.396284 0.94175 1.245259
H  -4.051713 0.149571 2.116512
H  -3.90762 1.866755 1.646467
H  -6.178773 -1.452763 -1.041526
