program: Gaussian 09
title: 000215984
version: EM64L-G09RevD.01
frameworkgroup: C1[X(C10H22N4S2)]
method: RPBEPBE
basis: SDD
operation: Freq
keyword: #p
keyword: freq=noraman
keyword: PBEPBE/SDD
title: #p freq=noraman PBEPBE/SDD
converged: YES YES NO NO
title: Mulliken charges:
elementType: S S N N N N C C C C C C C C C C H H H H H H H H H H H H H H H H H H H H H H
charge: 0.120757 0.120943 -0.070412 -0.070338 -0.396713 -0.397101 -0.350441 -0.348042 -0.350437 -0.348061 -0.364501 -0.365455 -0.364345 -0.365203 -0.611093 -0.611091 0.206961 0.212451 0.211790 0.198144 0.212445 0.207045 0.198000 0.211856 0.226265 0.237689 0.223395 0.232286 0.226279 0.237653 0.223390 0.232376 0.190909 0.221529 0.224317 0.190821 0.221600 0.224331
chargesum: 0.00000
title: Mulliken charges with hydrogens summed into heavy atoms:
elementType: S S N N N N C C C C C C C C C C
charge: 0.120757 0.120943 -0.070412 -0.070338 -0.396713 -0.397101 0.068971 0.061891 0.069054 0.061795 0.099454 0.090226 0.099587 0.090562 0.025663 0.025660
polarizability: 2.47122338e+02 -4.23770394e-02 1.59485069e+02 -3.01313003e+01 2.63271138e-02 1.64383257e+02
1716.lowfreq: -13.0024 -3.2585 0.0012 0.0016 0.0023 13.8306 27.3928 34.7934 42.3873
frequency: 27.0731 33.8479 42.3477 49.3250 68.1663 106.5344 120.5651 168.5813 177.7041 195.3228 203.8849 229.2830 230.3139 267.8701 323.4265 324.8769 336.4802 337.7433 350.8340 356.1230 379.1400 388.1119 427.4841 431.5845 468.0889 470.4906 552.0362 555.0450 645.3479 646.2224 742.7384 743.7804 828.6050 830.4121 905.8577 906.1600 919.6367 927.3939 998.5128 1003.2427 1034.6169 1035.0264 1037.3399 1039.6773 1054.8920 1056.5615 1082.3887 1085.8902 1130.2468 1130.6679 1134.2319 1134.9161 1142.6531 1143.4223 1183.9343 1186.6468 1217.7395 1218.5820 1276.0723 1277.5041 1279.2704 1281.3208 1310.4184 1311.1163 1326.6147 1326.9277 1337.0412 1339.1849 1340.5764 1340.7657 1362.8879 1364.9436 1429.8659 1430.2449 1433.1925 1433.6113 1441.1451 1442.0712 1453.3658 1454.5374 1461.0683 1461.3971 1473.6240 1474.7225 1480.8750 1481.0696 2850.5602 2856.7860 2860.5666 2862.0819 2875.6801 2875.9867 2983.1197 2983.3594 2986.6857 2987.5987 3018.8652 3019.0201 3023.3841 3024.6197 3030.3663 3031.1399 3076.5803 3076.7407 3080.9739 3081.2252 3092.4544 3092.5396
redmass: 4.2996 4.2967 4.1087 3.4796 3.4842 4.2913 4.3049 2.8389 2.9058 2.4190 2.5067 1.2439 1.3138 16.2186 2.2953 2.3141 1.9857 2.0176 4.6917 4.6648 2.8286 2.9428 2.2932 2.3238 2.8015 2.8023 3.4844 3.3816 2.5326 2.6059 3.2841 3.2597 1.5982 1.5896 2.2032 2.2028 3.3185 3.1965 2.5888 2.5986 2.0693 2.2210 1.8835 1.7922 1.6854 1.6692 1.6229 1.6039 1.7388 1.7732 3.9924 3.9519 2.5329 2.4800 1.1208 1.1199 2.1519 2.2144 1.4817 1.5058 1.5907 1.5559 1.3224 1.3314 1.2527 1.2521 1.3362 1.3410 1.3057 1.3124 1.3839 1.3818 1.1582 1.1628 1.0834 1.0821 1.0902 1.0910 1.0786 1.0764 1.0589 1.0578 1.0970 1.1004 1.0532 1.0531 1.0665 1.0614 1.0615 1.0663 1.0659 1.0658 1.0638 1.0638 1.0650 1.0653 1.0736 1.0736 1.0888 1.0887 1.0910 1.0908 1.1009 1.1009 1.0990 1.0990 1.0988 1.0988
irintensity: 0.5243 1.4473 0.0485 0.0271 0.0320 0.0051 0.8329 2.4332 1.5252 5.0745 4.7561 0.9823 1.3279 0.0183 47.4616 0.0072 0.4335 0.5869 18.5819 0.8555 1.1209 0.2889 22.9457 4.3564 1.5288 1.4278 49.3125 1.9315 8.2253 3.2354 1.0147 7.8167 0.2307 0.1402 0.5622 1.1557 146.4264 9.9512 67.8157 21.5966 4.6358 0.4028 5.9505 2.0492 12.0604 12.4083 9.7457 3.7212 4.6417 1.0265 8.4798 18.6167 76.2169 17.5791 2.0560 4.8068 0.9620 0.8244 4.9109 12.8755 32.4887 17.1117 4.2930 0.0221 0.8100 0.0798 1.8126 6.0854 39.1295 1.8319 23.1119 7.4221 3.6254 3.1233 8.9193 10.5732 16.4007 5.1948 2.7476 0.4414 37.0530 18.9978 27.1915 0.3193 10.1276 8.0633 112.2819 5.6148 60.6859 60.5409 149.1771 24.6565 14.1903 12.6991 190.9188 2.0900 67.5123 33.3429 23.3567 85.8015 145.1007 1.8406 30.7099 32.0361 27.9446 8.8356 14.4891 7.0471
temp: 298.150 k
press: 1.00000 atm
elementType: 16 16 7 7 7 7 6 6 6 6 6 6 6 6 6 6 1 1 1 1 1 1 1 1 1 1 1 1 1 1 1 1 1 1 1 1 1 1
symmnumber: 1
zpe: 851534.2 jmol-1
zpe.correction: 0.324332 hartree
zpe.thermalcorrener: 0.342528 hartree
zpe.thermalcorrenthalpy: 0.343472 hartree
zpe.thermalcorrgfe: 0.276775 hartree
zpe.sumelectzpe: -1408.014375 hartree
zpe.sumelectthermal: -1407.996178 hartree
zpe.sumelectthermalent: -1407.995234 hartree
zpe.sumelectthermalfe: -1408.061932 hartree
dipole: -0.0037 3.0922 -0.0042
dipole: 3.0922
quadrupole: -105.6285 -114.4697 -116.0805
quadrupole: -0.0051 6.2403 0.0174
quadrupole: 6.4311 -2.4101 -4.0210 -0.0051 6.2403 0.0174
hfenergy: -1408.3387068 hartree
pointgroup: C01 [X(C10H22N4S2)]
dipole: 0.0006716 -1.2164908 -0.0126702 debye
polarizability: 247.4625493|-0.3678599|159.4863531|29.6563029|-0.0864381|164.0417619 unknown
InChI: InChI=1S/2C5H11N2S/c2*1-6-2-4-7(8)5-3-6/h2*2-5H2,1H3
charge 0 multiplicity 1
38 atoms
S  -0.476713 1.885008 -1.150143
S  0.475291 1.857614 1.195723
N  -3.304969 -1.008591 0.301044
N  3.307909 -1.002774 -0.317743
N  -1.89386 0.879918 -1.378344
N  1.895218 0.851203 1.398177
C  -3.389833 0.448309 0.577728
C  -1.993276 -1.368801 -0.289385
C  3.386637 0.458927 -0.569502
C  1.998732 -1.377593 0.269104
C  -3.173666 1.246738 -0.728682
C  -1.765226 -0.577819 -1.597624
C  3.171983 1.233599 0.751281
C  1.770862 -0.610524 1.591492
C  -3.633596 -1.827373 1.483452
C  3.636655 -1.79974 -1.514961
H  -2.632025 0.773491 1.334598
H  -4.395611 0.6730 0.97988
H  -1.9882 -2.453145 -0.510172
H  -1.149073 -1.155161 0.415492
H  4.390244 0.694295 -0.970939
H  2.625101 0.794417 -1.318101
H  1.152565 -1.154462 -0.430427
H  1.997589 -2.465637 0.470941
H  -3.993044 1.005581 -1.434598
H  -3.172093 2.330695 -0.531268
H  -0.767366 -0.787914 -2.016971
H  -2.536846 -0.877564 -2.334299
H  3.994361 0.982776 1.450336
H  3.166233 2.320877 0.573102
H  0.77428 -0.830788 2.008705
H  2.544514 -0.921428 2.321414
H  -2.920186 -1.684503 2.334202
H  -3.628516 -2.897422 1.20754
H  -4.64702 -1.572058 1.84182
H  2.920367 -1.645257 -2.361271
H  3.636788 -2.874384 -1.257532
H  4.647991 -1.533912 -1.871569
